ID,ID Code,Sample Source,Q1. Gender,Q2. Age (years),Q2. Age ranges,Q3. ATSI origin,Q4. Country of birth,Q4. Other specify - Country of birth,Q4a. Year came to live in Australia,Q5. Travelled overseas this year,Q5a. Country spent most time overseas,Q6. Language other than English spoken at home,Q6. Other specify - Language other than English spoken at home,Q7. Highest educational qualification,Q7. Other specify - Highest educational qualification,Q8. State/territory reside,Q9. Employment,Q10. Children,Q10a. Have children attending childcare or school,Q11. Private healthcare insurance held,Q12. Income protection insurance held,Q13. Have computer at home,Q14. Have internet access at home,Q15. Rating of current health,Q16. Current health conditions - Heart Disease,"Q16. Current health conditions - Chronic respiratory conditions (Severe asthma, suppurative lung disease, bronchiectasis and cystic fibrosis)","Q16. Current health conditions - Chronic neurological conditions (e.g. multiple sclerosis, spinal cord injuries, seizure disorders etc.)","Q16. Current health conditions - Immunocompromising conditions (e.g. HIV, cancer, transplantation, regular steroid use)",Q16. Current health conditions - Metabolic disease,Q16. Current health conditions - Chronic liver disease,"Q16. Current health conditions - Other chronic illnesses (diabetes mellitus, chronic renal failure etc.)",Q16. Current health conditions - Other (specify),Q16. Current health conditions - None of the above,Q16. Other specify - Current health conditions,Q17. Rating of agreement with statements - I think the current COVID-19 situation is serious,Q17. Rating of agreement with statements - I think that whether I get the COVID-19 infection is out of my control,"Q17. Rating of agreement with statements - In general, I think the authorities are doing a good job of dealing with the COVID-19 situation",Q17. Rating of agreement with statements - Implementing travel restrictions for COVID-19 is a good idea,Q17. Rating of agreement with statements - I am worried about the current COVID-19 situation,Q17. Rating of agreement with statements - I am worried about my family getting COVID-19,Q17. Rating of agreement with statements - The government made the correct decision to ban large community events (i.e. sports games or concerts),Q17. Rating of agreement with statements - The government should implement school closure,Q18. Level of risk of catching COVID-19,Q19. Impact on health of COVID-19 if infected,Q20. Media/social media reports made you reconsider level of personal risk from COVID-19,Q21. Main source of information about COVID-19,Q21. Other specify - Main source of information about COVID-19,Q22. Level of trust in information about COVID-19 from Australian Government,Q23. Have cases of COVID-19 amongst family/friends,Q24. Rating of level of effectiveness to reduce risk of COVID-19 - Avoiding people who cough or sneeze,Q24. Rating of level of effectiveness to reduce risk of COVID-19 - Avoiding people who have travelled overseas in the last two weeks,Q24. Rating of level of effectiveness to reduce risk of COVID-19 - Avoiding public transport,Q24. Rating of level of effectiveness to reduce risk of COVID-19 - Taking antibiotics,Q24. Rating of level of effectiveness to reduce risk of COVID-19 - Working from home,Q24. Rating of level of effectiveness to reduce risk of COVID-19 - Cancellation of public events (i.e. sports events),Q24. Rating of level of effectiveness to reduce risk of COVID-19 - Wearing a face mask when you have no symptoms,Q24. Rating of level of effectiveness to reduce risk of COVID-19 - Using hand sanitiser/ alcohol rub,Q24. Rating of level of effectiveness to reduce risk of COVID-19 - Avoiding going to public events held indoors,Q24. Rating of level of effectiveness to reduce risk of COVID-19 - Avoiding going to outdoor public events,Q24. Rating of level of effectiveness to reduce risk of COVID-19 - Self-quarantine anyone who has travelled into Australia from overseas,Q24. Rating of level of effectiveness to reduce risk of COVID-19 - Shutting of restaurants/bars after 6pm,Q24. Rating of level of effectiveness to reduce risk of COVID-19 - Increased use of household products,Q25. Actions taken over last month due to COVID-19 - Deliberately cancelled or postponed a social event,Q25. Actions taken over last month due to COVID-19 - Cancelled or delayed travelling overseas,Q25. Actions taken over last month due to COVID-19 - Reduced my use of public transport,Q25. Actions taken over last month due to COVID-19 - Increased the amount of household groceries purchased,Q25. Actions taken over last month due to COVID-19 - Kept one or more of my children out of school or childcare,Q25. Actions taken over last month due to COVID-19 - Kept away from crowded places generally,"Q25. Actions taken over last month due to COVID-19 - Increased the time I spent cleaning or disinfecting things I might touch, such as door knobs",Q25. Actions taken over last month due to COVID-19 - Washed my hands with soap and water more often than usual,"Q25. Actions taken over last month due to COVID-19 - Used alcoholic hand gel more than usual, or hand sanitizer",Q26. Rating of ability to adopt social distancing strategies - Work from home,Q26. Rating of ability to adopt social distancing strategies - Keep children home during school closure,Q26. Rating of ability to adopt social distancing strategies - Stay in quarantine at your home (until you get your test results back),Q26. Rating of ability to adopt social distancing strategies - Avoid travelling overseas,Q26. Rating of ability to adopt social distancing strategies - Avoid going to a large event like a sports match,Q26. Rating of ability to adopt social distancing strategies - Self-isolation in one room in your house (because you have the infection),Q27. Motivations to comply with social distance strategy,Q27. Other specify - Motivations to comply with social distance strategy,Q28. Willing to comply if advised to self-isolate,Q28a. Reasons would not comply if advised to self-isolate,Q29. Rating of level of concern to situations if self-isolated - Not being able to access your GP,Q29. Rating of level of concern to situations if self-isolated - Not being able to attend work,Q29. Rating of level of concern to situations if self-isolated - Unable to attend church/religious service,Q29. Rating of level of concern to situations if self-isolated - Not being able to go to the shops for food or other supplies,Q29. Rating of level of concern to situations if self-isolated - Not being able to have physical contact with your family or friends,Q29. Rating of level of concern to situations if self-isolated - Not being able to go out to events/sports games,Q30. Have family member or friend to assist if self-isolated,Q31. Feel could manage if self-isolated at home,Q31a. Issues of concern if feel unable to manage if self-isolated at home - Loss of income,Q31a. Issues of concern if feel unable to manage if self-isolated at home - Spreading the infection to people living in the same house,Q31a. Issues of concern if feel unable to manage if self-isolated at home - Being lonely,Q31a. Issues of concern if feel unable to manage if self-isolated at home - Not being able to access food,Q31a. Issues of concern if feel unable to manage if self-isolated at home - Not being able to access medications,Q31a. Issues of concern if feel unable to manage if self-isolated at home - Negative comments from people,Q31a. Issues of concern if feel unable to manage if self-isolated at home - Feeling bored,Q31a. Issues of concern if feel unable to manage if self-isolated at home - Other (specify),Q31a. Other specify - Issues of concern if feel unable to manage if self-isolated at home,Q32. Awareness that vaccine for COVID-19 is being developed,Q33. Level of agreement with statements concerning future COVID-19 vaccine - Getting myself vaccinated for COVID-19 would be a good way to protect myself against infection,Q33. Level of agreement with statements concerning future COVID-19 vaccine - Vaccines are effective at preventing diseases,Q33. Level of agreement with statements concerning future COVID-19 vaccine - Diseases provide better immunity than vaccines do,Q33. Level of agreement with statements concerning future COVID-19 vaccine - Patients with risk factors should be the first ones to get the COVID-19 vaccine when available,Q33. Level of agreement with statements concerning future COVID-19 vaccine - My family and friends would probably think that getting a COVID-19 vaccine is a good idea,Q33. Level of agreement with statements concerning future COVID-19 vaccine - I generally do what my health care professional recommends,"Q33. Level of agreement with statements concerning future COVID-19 vaccine - To protect the health of the community, we should follow government guidelines about vaccines",Q33. Level of agreement with statements concerning future COVID-19 vaccine - Healthcare workers should be the first ones to get the COVID-19 vaccine
1,OUT1003,8,1,60,5,1,1,,,2,,1,,5,,7,4,5,2.0,2,2,1,1,4,0,0,0,0,0,0,0,0,1,,3,3,2,3,3,3,5,2,3,2,1,1,,2,2,5,5,3,4,4,3,2,4,3,3,5,3,2,1,3,3,2,3,1,2,1,2,4,6,4,5,4,4,6,,1,,3,3,6,3,3,2,1,1,0,0,0,0,0,0,0,0,,1,4,4,3,4,4,4,4,4
2,OUT1009,8,1,43,3,1,1,,,2,,1,,6,,2,1,1,,1,2,1,1,4,0,0,0,0,0,0,0,0,1,,4,3,3,3,3,4,3,4,3,2,2,1,,3,2,3,3,3,2,3,3,4,3,2,4,4,3,3,2,3,2,1,2,1,1,1,1,2,3,4,3,3,3,2,,1,,2,3,4,3,3,3,1,1,0,0,0,0,0,0,0,0,,2,3,3,4,3,3,3,4,4
3,OUT1001,8,2,36,2,1,1,,,2,,1,,6,,7,1,1,,1,1,1,1,4,0,0,0,0,0,0,0,0,1,,3,4,3,3,5,3,3,2,3,2,2,2,,4,2,2,5,3,2,3,4,2,4,3,2,5,2,4,2,3,2,2,3,2,1,1,1,4,6,5,5,4,4,6,,1,,3,2,1,3,1,1,1,1,0,0,0,0,0,0,0,0,,1,5,5,3,5,5,5,5,4
4,OUT1008,8,2,33,2,1,1,,,1,Japan,1,,6,,2,1,1,,2,2,1,1,3,1,0,0,0,0,0,0,0,0,,4,4,1,4,4,4,1,4,4,4,1,4,,1,2,1,5,3,2,4,2,5,5,3,4,4,4,3,2,2,3,2,1,3,2,3,1,1,6,6,3,5,6,4,,1,,4,4,1,2,5,3,1,1,0,0,0,0,0,0,0,0,,2,4,3,5,2,2,5,4,3
5,OUT1005,8,1,41,3,1,1,,,2,,2,chinese,7,,7,1,1,,1,2,1,1,3,0,0,0,0,0,0,0,0,1,,3,3,3,4,1,3,4,3,3,1,2,1,,4,2,4,5,5,1,3,5,3,3,4,4,5,1,3,1,1,1,2,3,1,2,2,2,5,6,6,5,5,6,3,,1,,1,1,6,4,5,6,1,1,0,0,0,0,0,0,0,0,,1,4,4,3,5,1,4,4,5
6,OUT1002,8,1,63,5,1,1,,,2,,1,,3,,2,7,3,2.0,1,2,1,1,3,0,0,0,0,0,0,0,0,1,,4,2,4,4,3,4,4,5,6,5,1,3,,3,2,4,4,4,4,4,4,4,4,4,4,4,4,4,3,3,3,2,3,1,1,1,1,6,6,5,6,5,5,2,,1,,1,6,6,1,6,6,1,1,0,0,0,0,0,0,0,0,,1,5,5,1,4,5,5,5,5
7,OUT1013,9,2,73,6,1,1,,,2,,1,,7,,5,9,4,2.0,1,2,1,1,4,0,0,0,0,0,0,0,0,1,,3,3,3,4,2,3,3,4,3,3,2,1,,3,2,5,5,5,2,5,5,2,4,5,5,5,3,5,1,2,2,2,3,2,2,1,1,6,6,3,4,5,3,1,,1,,4,6,1,2,1,1,1,1,0,0,0,0,0,0,0,0,,1,4,4,1,4,4,4,4,4
8,OUT1000,8,1,46,3,1,2,Indonesia,2019.0,2,,2,Indonesian,6,,2,5,1,,2,2,1,1,4,0,0,0,0,0,0,0,0,1,,3,3,3,3,3,3,3,5,2,2,2,4,,3,1,4,3,3,3,2,3,3,3,3,3,3,3,3,3,2,2,2,3,3,2,1,2,6,6,6,6,6,6,5,,1,,3,6,5,2,2,6,1,1,0,0,0,0,0,0,0,0,,1,4,4,3,4,4,4,4,4
9,OUT1007,8,1,63,5,1,2,Philippines,1986.0,2,,2,Tagalog,6,,2,7,2,2.0,2,2,1,1,5,0,0,0,0,0,0,0,0,1,,4,4,3,4,4,4,4,3,4,4,1,1,,4,2,5,5,5,1,5,5,5,5,5,5,3,4,3,1,1,1,2,3,1,1,1,1,5,5,5,5,5,5,1,,1,,4,6,3,5,5,5,1,1,0,0,0,0,0,0,0,0,,1,5,5,4,5,5,5,5,5
10,OUT1014,8,2,30,2,1,1,,,2,,1,,6,,2,8,1,,1,2,1,1,4,0,0,0,0,0,0,0,0,1,,4,3,4,4,3,4,4,4,3,2,2,3,,5,2,4,4,4,4,4,4,4,4,4,4,4,4,4,1,2,2,1,3,1,1,1,1,4,6,4,5,5,3,6,,1,,2,2,6,2,2,1,1,1,0,0,0,0,0,0,0,0,,1,5,5,1,5,5,5,5,5
11,OUT1011,8,2,45,3,1,1,,,2,,1,,5,,7,4,3,1.0,2,2,1,1,4,0,0,0,0,0,0,0,0,1,,2,3,3,3,2,2,2,1,6,5,1,3,,3,2,2,3,3,2,3,2,2,3,3,2,3,2,3,2,2,3,2,2,2,2,2,2,3,3,3,6,3,3,7,nothing,1,,2,3,1,1,2,1,1,1,0,0,0,0,0,0,0,0,,1,3,3,4,4,4,3,4,4
12,OUT1012,8,2,35,2,1,2,Indonesia,2002.0,1,Japan,2,Indonesian,6,,2,1,1,,1,2,1,1,4,0,0,0,0,0,0,0,0,1,,3,3,3,4,2,2,4,2,2,2,1,6,Online news,4,2,4,5,3,1,3,5,2,4,4,4,5,2,3,1,1,2,2,3,1,1,1,1,3,6,4,5,5,1,6,,1,,3,4,4,5,4,1,1,1,0,0,0,0,0,0,0,0,,1,5,5,1,5,5,5,5,5
13,OUT1016,8,2,59,4,1,2,Serbia,1970.0,2,,1,,5,,2,9,1,,2,2,1,1,4,0,0,0,0,0,0,0,0,1,,3,2,2,5,2,2,1,1,4,2,2,1,,4,2,5,5,3,2,5,3,3,3,4,3,5,3,3,2,3,3,2,3,2,1,1,1,6,6,3,5,5,5,1,,2,Nobody should be told to stay in one room in their house. We are not children,5,6,6,5,5,4,1,2,0,1,1,0,0,0,1,0,,1,5,4,3,4,5,5,5,5
14,OUT1006,8,2,38,2,1,1,,,1,thailand,1,,6,,2,1,2,1.0,1,2,1,1,4,0,0,0,0,0,0,0,0,1,,4,4,5,3,4,3,2,4,2,2,1,1,,4,2,5,3,4,4,4,2,4,2,3,4,4,2,4,1,2,2,1,1,2,2,2,2,5,5,4,3,3,3,3,,1,,1,1,2,2,2,3,1,1,0,0,0,0,0,0,0,0,,1,2,2,4,4,4,3,3,3
15,OUT1004,8,1,53,4,1,1,,,2,,1,,1,,7,1,1,,1,2,1,1,4,0,0,0,0,0,0,0,0,1,,4,4,4,4,4,4,4,4,6,2,2,1,,4,2,5,5,5,3,5,5,2,5,4,4,5,3,1,2,1,2,1,3,2,2,1,1,5,6,5,5,5,5,3,,1,,4,3,6,5,5,5,1,1,0,0,0,0,0,0,0,0,,1,5,5,1,5,5,5,5,5
16,OUT1017,8,1,59,4,1,1,,,2,,1,,5,,2,9,1,,2,2,1,1,4,0,0,0,0,0,0,0,0,1,,3,3,3,4,3,2,4,2,3,2,2,3,,4,3,5,5,4,1,4,4,3,5,3,4,5,4,5,3,3,3,2,3,2,2,2,2,5,6,5,5,4,5,1,,1,,1,6,3,4,3,3,2,1,0,0,0,0,0,0,0,0,,1,5,5,3,5,4,4,4,5
17,OUT1015,9,2,63,5,1,2,England,1961.0,1,New Zealand,1,,5,,2,1,3,2.0,1,2,1,1,4,0,0,0,0,0,0,0,0,1,,2,3,3,3,3,3,3,5,3,3,1,1,,4,3,5,5,5,4,3,4,3,4,5,4,5,4,4,1,3,3,2,3,1,2,1,2,2,6,4,5,5,3,2,,1,,3,5,6,5,4,1,1,1,0,0,0,0,0,0,0,0,,1,5,5,3,4,4,4,5,4
18,OUT1010,8,1,41,3,1,2,Israel,2006.0,2,,2,Hebrew,5,,7,1,1,,1,1,1,1,4,0,0,0,0,0,0,0,0,1,,3,3,2,3,3,3,3,3,2,2,2,1,,4,2,5,5,4,2,5,4,2,3,4,5,4,4,3,1,3,1,2,3,2,1,1,1,5,6,4,5,5,4,1,,1,,3,3,1,5,3,3,2,1,0,0,0,0,0,0,0,0,,1,4,4,3,4,4,3,4,5
19,OUT1018,8,1,46,3,1,1,,,2,,1,,6,,2,1,1,,1,2,1,1,5,0,0,0,0,0,0,0,0,1,,5,3,3,3,3,2,3,2,1,2,1,3,,5,2,5,5,2,2,5,1,1,3,3,2,5,1,2,1,3,1,2,3,1,2,1,2,5,6,5,5,5,5,6,,1,,1,1,6,3,1,1,1,1,0,0,0,0,0,0,0,0,,1,4,5,2,5,4,4,5,4
20,OUT1019,8,2,46,3,1,1,,,1,UAE,1,,7,,7,1,2,2.0,1,2,1,1,5,0,0,0,0,0,0,0,0,1,,3,2,3,3,3,3,4,3,3,2,1,1,,4,2,5,4,4,2,4,4,2,4,4,4,4,4,3,1,2,1,1,3,1,2,1,1,2,4,4,3,4,2,1,,1,,4,3,4,4,5,4,1,1,0,0,0,0,0,0,0,0,,1,5,5,2,5,5,5,5,5
21,OUT1021,9,2,63,5,1,2,hong kong,1985.0,2,,2,Cantonese,5,,7,3,2,2.0,2,2,1,1,3,0,0,0,0,0,0,0,0,1,,4,4,4,4,4,4,4,3,4,2,1,3,,5,2,5,5,4,3,4,5,3,5,5,5,5,4,5,1,3,1,1,3,1,1,1,1,4,6,6,4,4,6,6,,1,,4,5,4,4,4,4,1,1,0,0,0,0,0,0,0,0,,1,4,4,2,4,5,4,5,5
22,OUT1020,8,2,36,2,1,2,ukraine,1992.0,2,,2,russian,6,,7,9,1,,1,2,1,1,2,0,0,0,0,0,0,0,0,1,,4,5,2,4,4,4,4,5,3,2,2,2,,3,2,5,4,4,1,5,5,3,4,5,4,3,3,3,2,2,1,2,3,1,2,1,2,5,6,5,5,5,5,1,,1,,2,6,6,3,3,1,1,1,0,0,0,0,0,0,0,0,,1,3,4,1,5,4,4,4,3
23,OUT1022,8,1,63,5,1,1,,,2,,1,,2,,7,9,1,,2,2,1,1,4,1,0,0,0,0,0,0,0,0,,4,4,3,4,4,4,4,2,4,3,2,1,,4,3,4,5,5,4,4,5,3,4,4,3,5,5,3,2,3,1,2,3,1,3,1,2,6,6,6,6,5,3,1,,1,,5,6,6,5,2,2,2,1,0,0,0,0,0,0,0,0,,2,3,3,3,3,3,3,3,3
24,OUT1027,9,2,72,6,1,1,,,2,,1,,7,,8,9,5,2.0,1,2,1,1,4,0,0,0,0,0,0,0,0,1,,3,2,4,4,3,3,4,2,3,2,1,2,,4,2,3,5,3,3,4,4,2,5,4,4,5,4,2,2,2,2,2,2,1,2,1,1,6,6,5,5,5,4,1,,1,,3,6,1,3,2,2,2,1,0,0,0,0,0,0,0,0,,1,5,4,3,4,5,5,5,5
25,OUT1023,9,1,70,6,1,2,England,1972.0,2,,1,,6,,8,9,5,2.0,2,2,1,1,4,1,0,0,0,0,0,0,0,0,,4,3,3,4,3,3,4,2,2,2,1,3,,4,2,4,4,3,1,3,4,3,2,3,3,4,2,2,3,1,3,2,3,1,2,1,1,6,6,5,5,5,5,6,,1,,1,6,6,2,3,6,1,1,0,0,0,0,0,0,0,0,,1,5,5,2,5,5,5,5,5
26,OUT1025,8,1,60,5,1,1,,,2,,1,,3,,2,1,3,2.0,1,2,1,1,4,0,0,0,0,0,0,0,0,1,,3,5,3,4,3,2,4,4,3,2,1,1,,3,2,4,5,3,1,4,5,1,4,4,5,5,3,3,1,2,2,2,2,1,2,1,1,4,6,4,5,5,3,1,,2,too hard to stay in one room,5,1,6,5,3,1,1,1,0,0,0,0,0,0,0,0,,1,4,4,1,5,4,4,4,3
27,OUT1026,9,1,74,6,1,1,,,2,,1,,6,,6,9,3,2.0,1,2,1,1,5,0,0,0,0,0,0,0,0,1,,4,2,3,4,3,3,4,3,3,3,1,2,,3,2,5,5,5,1,5,4,2,4,5,4,5,3,4,1,1,3,1,3,1,1,1,1,5,6,3,5,5,5,6,,1,,4,6,6,4,2,1,2,1,0,0,0,0,0,0,0,0,,1,5,5,2,5,5,4,5,5
28,OUT1030,8,2,51,4,1,1,,,2,,1,,6,,7,3,4,2.0,1,1,1,1,5,0,0,0,0,0,0,0,0,1,,3,1,3,3,2,1,5,5,1,2,2,1,,4,2,4,5,3,1,5,4,2,5,4,3,5,2,1,2,1,3,2,3,1,2,2,3,5,6,3,5,3,2,6,,1,,1,4,4,1,4,1,1,1,0,0,0,0,0,0,0,0,,1,3,5,1,5,5,4,4,5
29,OUT1034,9,1,32,2,1,1,,,2,,1,,4,,7,5,1,,2,2,1,1,3,0,0,0,0,0,0,0,0,1,,3,2,3,3,3,3,4,4,3,2,1,4,,3,2,4,4,3,1,4,4,1,4,4,4,4,3,4,2,3,2,2,3,1,2,1,2,5,6,5,5,5,5,6,,1,,3,3,1,5,5,1,1,1,0,0,0,0,0,0,0,0,,1,4,5,1,5,5,5,5,5
30,OUT1032,8,2,43,3,1,1,,,2,,1,,5,,7,1,4,2.0,1,2,1,1,3,0,0,0,0,0,0,0,0,1,,2,4,3,4,1,1,1,1,2,2,2,1,,3,2,2,5,1,1,2,3,1,3,2,3,5,1,2,2,2,2,2,2,2,2,2,2,1,1,3,4,2,4,3,,2,"I dont have a toilet in that room, would require a shower or bath as well during the 14 days and need to eat. Therefore I would be in multiple rooms across the house. Not feasable to remain in 1 room.",1,2,6,1,1,1,1,1,0,0,0,0,0,0,0,0,,1,5,5,2,4,4,4,5,5
31,OUT1031,9,2,43,3,1,1,,,2,,1,,7,,2,1,2,1.0,1,2,1,1,2,0,0,0,0,0,0,0,0,1,,4,3,2,4,4,4,4,4,4,4,1,2,,4,2,4,5,4,1,5,5,2,4,5,5,5,4,4,1,1,1,1,1,1,1,1,1,5,5,5,5,5,5,2,,1,,1,2,1,3,5,1,1,2,1,0,1,1,0,0,0,0,,1,5,5,2,4,3,5,5,5
32,OUT1036,8,2,52,4,1,1,,,2,,2,german,1,,7,4,3,2.0,2,2,1,1,4,0,1,0,0,0,0,0,0,0,,4,4,1,4,3,3,3,4,5,4,2,3,,4,3,5,5,4,3,5,5,2,5,5,5,5,5,3,3,1,1,2,2,1,1,1,1,5,5,5,5,5,5,6,,1,,1,5,1,5,1,1,1,1,0,0,0,0,0,0,0,0,,1,5,5,1,5,5,5,5,5
33,OUT1041,9,2,60,5,1,2,italy,1963.0,2,,1,,3,,8,6,1,,2,2,1,1,2,1,0,0,0,0,0,0,0,0,,2,2,2,3,2,2,2,2,1,5,2,1,,1,2,2,2,2,2,2,2,2,2,2,2,2,2,2,2,2,2,2,2,2,2,2,2,1,6,1,1,1,1,2,,1,,1,1,1,1,1,1,1,1,0,0,0,0,0,0,0,0,,1,1,1,4,1,1,1,1,5
34,OUT1024,8,2,50,4,1,1,,,2,,1,,5,,2,1,4,2.0,1,1,1,1,3,0,0,0,0,0,0,0,0,1,,4,3,3,4,4,4,4,3,2,2,2,4,,3,2,4,5,3,3,3,3,3,3,3,3,5,1,3,2,2,1,1,1,2,2,1,1,4,5,5,5,5,3,2,,1,,1,2,1,5,4,1,1,1,0,0,0,0,0,0,0,0,,1,4,5,3,4,5,4,4,4
35,OUT1038,8,2,20,1,1,1,,,2,,1,,2,,2,8,1,,2,2,1,1,5,0,0,0,0,0,0,0,0,1,,4,3,4,3,3,4,2,4,3,1,2,4,,1,2,4,2,2,2,2,2,3,3,3,2,3,3,3,2,2,1,1,2,2,2,2,1,2,2,3,2,1,3,1,,2,just how i feel,2,3,2,2,3,3,2,2,0,0,0,0,1,0,1,0,,2,4,3,4,3,2,3,4,3
36,OUT1040,9,2,78,6,1,1,,,2,,1,,2,,2,9,3,2.0,2,2,1,1,2,1,0,0,0,0,0,1,0,0,,4,3,3,4,3,4,4,2,3,3,1,1,,3,2,5,5,3,2,4,2,2,5,5,4,4,2,4,2,3,2,2,3,1,1,1,1,6,6,5,6,4,3,1,,1,,4,6,2,2,2,1,1,1,0,0,0,0,0,0,0,0,,1,5,5,3,5,4,4,4,5
37,OUT1045,9,1,59,4,1,1,,,2,,1,,2,,7,7,3,2.0,2,2,1,1,4,0,0,0,0,0,0,0,0,1,,3,4,3,4,3,5,4,5,6,2,2,1,,3,2,3,5,5,2,2,5,3,4,5,3,5,5,5,2,3,1,2,2,2,1,1,1,6,6,5,5,5,3,6,,1,,5,6,6,5,5,1,1,1,0,0,0,0,0,0,0,0,,1,4,5,1,5,5,5,5,5
38,OUT1044,8,1,42,3,1,1,,,2,,1,,5,,2,5,2,2.0,2,2,1,1,5,0,0,0,0,0,0,0,0,1,,4,1,4,4,4,4,4,2,3,4,1,1,,5,2,5,5,4,3,5,5,3,4,5,5,5,4,3,1,2,1,2,2,1,1,1,1,4,5,5,5,5,5,1,,1,,4,1,1,4,5,1,1,1,0,0,0,0,0,0,0,0,,1,5,5,1,5,5,5,5,5
39,OUT1042,9,1,52,4,1,1,,,2,,1,,5,,4,1,3,2.0,2,2,1,1,5,0,0,0,0,0,0,0,0,1,,2,3,5,3,2,2,3,3,1,2,2,2,,3,2,2,2,4,1,4,4,1,2,4,4,3,3,2,2,3,3,2,3,2,2,1,2,4,6,5,5,3,4,1,,1,,4,5,6,5,3,1,1,1,0,0,0,0,0,0,0,0,,1,3,3,4,4,3,4,3,4
40,OUT1047,9,2,75,6,1,1,,,1,new zealand,1,,3,,6,9,3,2.0,1,2,1,1,4,1,0,0,0,0,0,0,0,0,,4,4,2,4,4,4,4,2,3,2,1,1,,3,2,3,5,4,2,4,4,2,4,4,3,4,3,2,3,1,3,2,3,1,2,1,2,6,6,5,5,5,5,2,,1,,4,6,6,2,4,2,1,1,0,0,0,0,0,0,0,0,,1,5,5,2,5,5,5,5,5
41,OUT1046,9,1,76,6,1,1,,,2,,1,,3,,4,9,4,2.0,1,2,1,1,4,0,1,0,0,0,0,0,0,0,,3,3,3,3,3,2,3,2,2,3,1,6,radio,3,2,4,4,4,2,2,4,2,3,4,3,4,3,2,1,3,1,2,3,1,2,1,1,6,6,1,3,3,1,1,,2,"I am the only one here, so I could move around the house by myself",3,1,1,3,2,1,1,1,0,0,0,0,0,0,0,0,,1,4,4,3,4,4,4,5,5
42,OUT1037,9,1,59,4,1,2,England,1972.0,2,,1,,5,,2,7,3,2.0,2,2,1,1,3,0,0,0,0,0,0,0,1,0,Arthritus,3,5,3,4,3,3,3,3,3,5,1,1,,3,2,4,5,5,4,5,4,3,5,5,4,5,3,5,1,2,2,1,3,1,1,1,1,6,6,5,4,5,3,6,,1,,4,6,1,4,4,1,1,1,0,0,0,0,0,0,0,0,,1,4,4,4,5,5,4,4,5
43,OUT1048,9,1,68,5,1,1,,,2,,1,,7,,5,9,5,2.0,1,2,1,1,2,0,0,0,0,0,0,1,0,0,,4,4,5,4,4,3,4,5,3,4,1,1,,1,2,5,5,5,1,5,5,1,5,5,5,5,5,1,1,3,1,1,3,1,2,1,1,6,6,5,5,5,6,1,,1,,5,6,6,5,4,1,1,1,0,0,0,0,0,0,0,0,,1,5,5,5,5,5,4,4,5
44,OUT1049,8,1,30,2,1,1,,,1,vietnam,1,,6,,7,1,1,,2,2,1,1,4,0,0,0,0,0,0,0,0,1,,5,5,5,5,5,5,5,5,3,5,2,5,,3,2,3,1,2,2,3,1,2,1,1,2,2,2,2,3,3,3,3,3,3,3,3,3,6,6,6,6,6,6,6,,2,none,6,6,6,6,6,6,2,1,0,0,0,0,0,0,0,0,,2,3,3,3,3,3,3,3,3
45,OUT1050,9,2,76,6,1,1,,,2,,1,,6,,5,9,3,2.0,1,2,1,1,4,0,0,0,0,0,0,1,0,0,,4,2,4,4,2,4,4,2,2,3,1,3,,5,2,5,5,5,2,4,5,4,4,4,5,5,4,4,2,3,3,2,3,1,1,1,1,6,6,4,4,4,4,2,,1,,5,6,5,5,5,4,1,1,0,0,0,0,0,0,0,0,,1,5,5,2,5,5,5,5,5
46,OUT1033,9,2,67,5,1,1,,,2,,1,,4,,4,9,3,2.0,1,2,1,1,2,1,0,0,0,0,0,0,1,0,"parkinsons, melanoma",3,3,5,3,3,4,3,3,4,5,1,1,,4,3,4,4,4,3,4,4,4,4,4,5,5,4,4,3,3,2,2,3,2,2,1,1,6,3,4,4,4,3,1,,1,,3,6,6,3,2,6,1,1,0,0,0,0,0,0,0,0,,1,4,4,2,4,4,4,4,4
47,OUT1051,9,2,71,6,1,1,,,2,,1,,2,,4,1,4,2.0,1,2,1,1,4,1,0,0,0,0,0,0,0,0,,3,3,3,3,3,3,4,2,3,2,2,1,,4,2,5,4,3,1,4,4,2,5,4,4,5,3,4,2,3,2,1,3,1,2,1,1,6,6,5,5,5,4,6,,1,,3,3,2,3,3,1,1,1,0,0,0,0,0,0,0,0,,1,5,5,2,5,5,5,5,5
48,OUT1054,9,1,69,5,1,1,,,2,,2,Latvian,5,,4,9,1,,2,2,1,1,5,0,0,0,0,0,0,0,0,1,,4,1,4,4,2,1,4,1,1,1,2,2,,4,2,3,4,4,1,4,4,1,1,4,3,4,4,2,3,3,3,2,3,3,2,2,3,6,6,1,6,6,1,7,Because I'm asked to,2,"I would not stay in one room of the house, I live alone so there would be no need for me to do that",1,6,5,3,1,6,1,1,0,0,0,0,0,0,0,0,,1,1,1,3,3,3,1,3,3
49,OUT1057,9,2,75,6,1,1,,,2,,1,,3,,4,9,4,2.0,1,2,1,1,3,0,0,0,0,0,0,1,0,0,,4,3,4,4,3,4,4,2,3,3,1,1,,4,2,4,4,3,2,2,4,3,3,3,3,4,3,4,1,3,1,2,3,1,2,1,1,6,6,6,6,3,3,1,,1,,4,6,6,3,4,6,1,1,0,0,0,0,0,0,0,0,,1,4,4,4,5,4,4,4,4
50,OUT1062,8,1,62,5,1,1,,,2,,1,,6,,2,1,3,2.0,2,2,1,1,5,0,0,0,0,0,0,0,0,1,,4,2,3,3,3,3,3,3,1,2,2,1,,3,2,4,5,4,4,2,4,2,5,4,4,5,4,4,2,3,3,2,3,2,2,1,1,6,6,4,5,5,5,6,,1,,4,5,6,5,1,4,2,1,0,0,0,0,0,0,0,0,,1,2,3,2,5,4,4,4,5
51,OUT1055,9,2,69,5,1,1,,,2,,1,,5,,2,9,3,2.0,1,2,1,1,4,1,0,0,0,0,0,0,0,0,,3,2,2,4,3,4,3,1,3,2,2,3,,4,2,5,5,5,1,4,4,1,4,4,3,5,2,1,1,2,1,2,3,1,2,1,2,6,6,5,5,5,5,6,,1,,2,6,1,1,3,1,1,1,0,0,0,0,0,0,0,0,,1,5,5,3,5,5,5,4,5
52,OUT1059,9,2,50,4,1,1,,,2,,1,,6,,5,1,3,2.0,1,1,1,1,5,0,0,0,0,0,0,0,0,1,,4,2,2,4,4,3,4,4,5,2,1,3,,3,2,4,4,4,1,4,5,2,3,5,5,4,4,3,1,1,3,1,2,1,1,1,1,6,5,5,5,5,3,3,,1,,2,5,6,4,3,2,1,1,0,0,0,0,0,0,0,0,,1,5,5,1,5,5,5,5,5
53,OUT1029,9,2,62,5,1,2,England,1961.0,1,new zealand,1,,7,,4,1,1,,1,2,1,1,4,0,0,0,0,0,0,0,1,0,Possibly nerve damage as I constantly feel cold sensation on my back regardless of actual temperature',3,5,2,3,4,2,3,5,2,5,2,6,internet usually news sites but also wikipedia,2,2,2,4,3,1,4,3,3,4,3,1,4,2,3,3,3,3,1,3,1,1,1,1,5,6,5,5,5,3,6,,1,,2,2,6,4,4,2,1,1,0,0,0,0,0,0,0,0,,1,5,5,2,3,4,5,4,4
54,OUT1056,8,1,29,1,1,1,,,2,,1,,5,,7,1,1,,2,2,1,1,4,0,0,0,0,0,0,0,0,1,,3,4,4,4,4,4,4,3,4,2,2,3,,3,2,5,5,5,5,5,5,5,5,5,5,5,5,5,1,2,2,1,2,2,2,2,2,5,4,4,4,4,3,2,,1,,3,5,6,5,5,6,1,1,0,0,0,0,0,0,0,0,,1,4,5,5,4,4,5,4,5
55,OUT1053,8,1,63,5,1,1,,,2,,1,,7,,2,1,1,,1,2,1,1,4,0,0,0,0,0,0,0,0,1,,4,3,4,4,4,4,4,5,3,2,1,6,internet,4,2,5,5,4,1,4,4,2,5,4,4,5,4,3,2,3,3,1,3,1,2,1,1,1,6,3,6,5,6,1,,1,,3,1,3,3,3,1,1,1,0,0,0,0,0,0,0,0,,2,5,5,3,5,5,5,5,5
56,OUT1066,9,2,64,5,1,1,,,2,,1,,5,,4,1,1,,2,2,1,1,4,0,0,0,0,0,0,0,0,1,,4,2,3,4,4,3,4,5,1,1,2,1,,4,2,4,5,3,1,3,3,3,3,4,4,4,3,3,2,3,3,2,3,1,3,1,1,6,6,4,6,6,3,6,,1,,6,3,6,4,3,3,1,1,0,0,0,0,0,0,0,0,,1,5,4,3,5,4,5,4,5
57,OUT1068,9,1,74,6,1,2,uk,1970.0,2,,1,,5,,6,9,4,2.0,1,2,1,1,3,0,1,0,0,0,0,0,1,0,diverticulitis,4,4,3,4,4,4,4,5,3,3,1,3,,4,2,5,5,5,3,5,5,2,3,5,5,5,5,3,3,3,3,2,3,1,2,1,3,6,6,4,6,6,5,6,,1,,3,6,1,5,4,6,2,1,0,0,0,0,0,0,0,0,,1,5,5,3,5,5,4,5,5
58,OUT1070,8,2,58,4,1,1,,,2,,1,,6,,7,1,2,1.0,1,2,1,1,3,0,0,0,1,0,0,0,1,0,Crohn's Disease,3,3,3,3,2,3,3,1,4,2,2,3,,3,2,4,5,4,1,5,3,1,3,5,1,3,1,3,2,2,2,2,2,1,2,1,2,5,4,4,5,5,3,6,,1,,3,1,6,4,4,1,1,1,0,0,0,0,0,0,0,0,,1,5,5,2,1,5,4,5,3
59,OUT1069,8,1,61,5,1,1,,,2,,1,,5,,2,9,2,2.0,1,2,1,1,4,0,0,0,0,0,0,0,0,1,,3,1,3,4,3,3,4,1,2,3,1,1,,5,2,3,5,2,3,1,2,2,5,1,2,5,2,4,2,1,2,2,3,2,2,1,1,6,6,5,5,5,5,2,,1,,4,6,6,4,5,1,1,1,0,0,0,0,0,0,0,0,,1,5,5,1,4,5,5,5,5
60,OUT1061,9,1,69,5,1,1,,,2,,1,,1,,4,9,4,2.0,2,2,1,1,5,0,0,0,0,0,0,0,0,1,,4,4,3,4,4,4,4,5,5,4,1,3,,3,1,5,5,5,5,5,5,5,5,5,5,5,5,5,1,1,1,2,1,1,1,1,1,5,3,5,5,5,5,6,,1,,5,4,1,1,1,1,1,1,0,0,0,0,0,0,0,0,,1,5,5,5,5,5,5,5,5
61,OUT1058,9,1,34,2,1,1,,,1,asia,1,,3,,2,1,3,1.0,1,1,1,1,5,0,0,0,0,0,0,0,0,1,,2,2,2,3,2,3,3,3,3,3,2,3,,3,1,3,5,4,4,4,4,5,4,4,3,4,4,4,2,1,2,2,3,1,1,3,1,3,3,4,3,3,4,4,,1,,1,3,4,3,2,4,2,2,0,1,0,0,0,0,0,0,,1,2,3,2,4,3,3,2,3
62,OUT1071,9,2,60,5,1,1,,,1,new zealand,1,,3,,7,1,1,,1,2,1,1,3,1,0,0,1,0,0,0,0,0,,4,3,2,4,4,3,4,5,3,3,2,3,,3,2,5,5,4,2,5,4,2,4,5,3,4,3,3,1,2,2,2,3,1,2,1,1,3,6,5,5,5,4,6,,1,,3,2,4,3,3,1,1,1,0,0,0,0,0,0,0,0,,1,5,4,2,5,5,4,4,5
63,OUT1064,9,2,57,4,1,2,United Kingdom,2002.0,2,,1,,5,,5,7,2,2.0,1,2,1,1,4,0,0,0,0,0,0,0,1,0,Chronic Back Pain,3,3,3,4,3,3,5,1,2,2,1,3,,5,2,3,4,3,1,4,2,2,3,4,3,4,1,2,2,2,2,2,2,2,2,2,2,5,2,5,5,5,5,2,,1,,1,6,3,3,4,1,1,1,0,0,0,0,0,0,0,0,,1,5,5,4,5,5,5,5,5
64,OUT1073,9,1,65,5,1,1,,,2,,1,,6,,7,6,3,2.0,1,2,1,1,3,0,0,0,0,0,0,0,0,1,,3,2,3,4,5,2,4,5,2,3,2,1,,4,2,3,5,3,1,4,5,2,4,4,4,4,3,3,1,3,3,1,3,2,2,1,2,6,6,3,5,5,3,1,,1,,3,6,6,3,2,6,1,1,0,0,0,0,0,0,0,0,,1,4,5,3,5,4,4,4,5