Basic Information,Unnamed: 1,Unnamed: 2,Unnamed: 3,Unnamed: 4,Presenting symptoms and signs   ,Unnamed: 6,Unnamed: 7,Unnamed: 8,Unnamed: 9,Unnamed: 10,Unnamed: 11,Unnamed: 12,Unnamed: 13,Unnamed: 14,Unnamed: 15,Unnamed: 16,Unnamed: 17,Unnamed: 18,Unnamed: 19,Underlying disease,Unnamed: 21,Unnamed: 22,Unnamed: 23,Unnamed: 24,Comorbidities,Unnamed: 26,Unnamed: 27,Unnamed: 28,Unnamed: 29,Unnamed: 30,Unnamed: 31,Unnamed: 32,Unnamed: 33,Unnamed: 34,Unnamed: 35
Clinical type,Number,Age,Sex,Course of disease (days),Cough,Fever,Fatigue,Expectoration,Dyspnea,Myalgia,Chills,Headache,Anhelation,Diarrhea,Maximum body temperature (℃),SaO2,PO2,P(a/A) O2,P(A-a) O2 ,Cardiovascular diseases  ,Hypertension,Diabetes,COPD,HBV,Liver insufficiency,Cardiac insufficiency,Renal insufficiency,Interferon inhalation,Oxygen treatment,Antiviral treatment,Traditional Chinese medicine,Antibiotic treatment,Hormone therapy,Intravenous immunoglobulin therapy  ,Mechanical Ventilation
Non-severe,CoV-013,29,Female,20,yes,yes,yes,no,no,no,no,no,no,yes,38,,,,,no,no,no,no,no,no,no,no,yes,no,no,no,no,no,no,no
Non-severe,CoV-072,54,Female,14,no,yes,yes,no,yes,no,no,no,yes,no,37.7,99,155,2,97,no,no,no,no,no,no,no,no,yes,yes,yes,no,no,yes,no,no
Non-severe,CoV-091,29,Female,30,yes,yes,yes,yes,no,no,no,no,no,no,37.7,99,138,2,87,no,no,no,no,no,yes,no,no,yes,yes,yes,yes,no,no,no,no
Severe,CoV-006,62,Male,15,yes,yes,yes,yes,yes,yes,no,no,yes,no,38.5,99,115,1,113,yes,yes,yes,no,no,no,no,no,yes,yes,yes,no,yes,yes,yes,no
Severe,CoV-069,84,Female,35,yes,yes,yes,yes,yes,no,yes,yes,yes,yes,39.5,99,110,1,100,no,no,no,yes,no,no,yes,no,yes,yes,yes,yes,yes,yes,no,yes
Non-severe,CoV-053,43,Female,24,yes,yes,yes,no,yes,yes,no,no,no,no,38.9,97,84,1,106,yes,no,no,no,no,no,yes,no,yes,yes,yes,no,no,no,no,no
Severe,CoV-016,43,Male,21,yes,yes,no,no,yes,yes,yes,yes,no,no,39.1,98,101,1,103,yes,yes,no,no,no,yes,yes,yes,yes,yes,yes,yes,yes,no,no,no
Severe,CoV-021,43,Male,13,yes,yes,yes,no,yes,yes,no,no,no,no,38,97,83,1,103,yes,no,no,no,no,no,yes,no,yes,yes,yes,yes,yes,no,no,no
Non-severe,CoV-094,43,Female,12,no,yes,no,no,no,no,no,no,no,no,38.2,,,,,no,no,no,no,no,no,yes,no,yes,yes,yes,yes,no,no,no,no
Non-severe,CoV-020,39,Female,19,yes,yes,yes,no,no,no,no,no,no,no,38.3,98,97,1,93,no,no,no,no,no,no,no,no,yes,yes,yes,yes,no,no,no,no
Non-severe,CoV-052,23,Male,19,yes,yes,no,no,no,yes,no,no,no,no,38.2,85,50,1,97,no,no,no,no,no,no,no,no,yes,yes,yes,yes,no,no,no,no
Severe,CoV-022,62,Male,17,yes,yes,yes,no,no,yes,no,no,no,no,38,58,32,0,91,no,no,no,yes,no,yes,yes,no,yes,yes,yes,no,yes,no,yes,no
Non-severe,CoV-038,28,Female,28,yes,yes,no,no,no,no,no,no,no,no,,99,140,1,102,no,no,no,no,no,no,no,no,yes,yes,yes,yes,no,no,no,no
Non-severe,CoV-050,36,Male,18,yes,yes,yes,no,no,yes,no,yes,no,no,38.5,,,,,no,no,no,no,no,yes,yes,yes,yes,yes,yes,yes,yes,no,no,no
Non-severe,CoV-003,29,Male,16,no,yes,yes,no,no,yes,yes,yes,no,no,38.9,,,,,no,no,no,no,no,no,yes,no,yes,yes,yes,yes,yes,no,yes,no
Severe,CoV-092,82,Female,22,yes,yes,yes,no,yes,yes,no,yes,no,no,37.5,96,75,1,100,yes,yes,no,no,no,no,no,no,yes,yes,yes,yes,yes,no,no,no
Non-severe,CoV-079,53,Female,29,no,yes,yes,no,no,yes,yes,no,no,no,38.5,98,95,1,100,yes,yes,yes,no,no,no,yes,no,no,yes,no,yes,no,no,no,no
Non-severe,CoV-093,47,Female,45,yes,yes,yes,no,no,yes,yes,yes,no,no,38.5,99,138,2,90,no,no,no,no,no,yes,no,no,yes,yes,yes,yes,no,no,no,no
Non-severe,CoV-025,23,Male,17,yes,yes,no,yes,no,no,no,no,no,no,39.2,100,164,2,103,no,no,no,no,no,no,yes,no,yes,yes,yes,yes,no,no,no,no
Non-severe,CoV-024,47,Male,16,yes,yes,yes,no,no,yes,no,yes,no,no,38.5,99,128,1,95,no,no,no,no,no,no,yes,no,yes,yes,yes,yes,no,no,no,no
Non-severe,CoV-075,38,Male,32,yes,yes,yes,yes,no,yes,no,no,no,no,38,94,75,1,87,no,no,no,no,no,yes,no,no,yes,yes,yes,yes,yes,yes,no,no
Non-severe,CoV-040,47,Female,24,yes,yes,yes,no,no,yes,no,no,no,no,38.9,99,138,2,92,yes,yes,no,no,no,yes,no,no,yes,yes,yes,yes,yes,no,no,no
Non-severe,CoV-034,46,Female,16,yes,yes,yes,yes,yes,yes,yes,yes,yes,no,39,99,135,1,105,no,no,no,no,no,no,no,no,yes,yes,yes,no,yes,no,no,no
Non-severe,CoV-010,45,Female,18,yes,yes,yes,no,no,yes,no,no,no,no,38.5,97,92,1,97,yes,yes,no,no,no,yes,no,no,yes,yes,yes,yes,yes,no,no,no
Severe,CoV-051,34,Female,28,yes,yes,yes,yes,yes,no,yes,no,no,no,39.5,95,75,1,101,no,no,no,no,no,yes,yes,no,no,yes,yes,yes,yes,yes,no,yes
Non-severe,CoV-005,48,Male,12,no,no,no,no,no,no,no,no,no,no,36.8,99,149,1,103,no,no,no,no,no,yes,yes,no,no,yes,no,yes,no,no,no,no
Non-severe,CoV-007,20,Male,13,yes,yes,yes,no,no,yes,no,yes,no,no,37.5,,,,,no,no,no,no,no,no,no,no,yes,yes,yes,yes,no,no,no,no
Severe,CoV-008,47,Male,21,yes,yes,yes,no,yes,no,yes,no,yes,no,41,98,103,1,102,no,no,yes,no,yes,no,no,no,yes,yes,no,no,yes,yes,yes,no
Non-severe,CoV-014,22,Male,14,yes,no,no,yes,no,yes,no,no,no,no,36.5,98,109,1,100,no,no,no,no,no,no,no,no,yes,yes,yes,yes,no,no,no,no
Non-severe,CoV-017,39,Female,23,yes,yes,yes,yes,yes,no,no,no,no,no,38,96,74,1,106,no,no,no,no,no,no,yes,no,yes,no,yes,yes,no,no,no,no
Non-severe,CoV-037,40,Male,20,yes,yes,yes,yes,no,no,yes,no,no,no,37.5,97,90,1,93,no,no,no,no,no,no,no,no,yes,yes,yes,no,no,no,no,no
Non-severe,CoV-015,33,Male,17,yes,yes,yes,yes,no,yes,no,yes,no,no,38.8,99,108,1,115,no,no,yes,no,no,yes,yes,no,yes,yes,yes,yes,yes,no,no,no
Non-severe,CoV-056,62,Male,22,yes,no,yes,no,no,yes,no,yes,no,no,37,100,167,2,98,no,no,yes,no,no,yes,no,no,yes,yes,yes,yes,no,no,no,no
Non-severe,CoV-030,50,Female,23,yes,yes,no,yes,no,no,no,no,no,no,38.5,97,87,1,95,yes,yes,no,no,no,yes,no,no,yes,yes,yes,no,no,no,no,no
Non-severe,CoV-057,27,Male,14,no,yes,yes,no,no,no,yes,yes,no,no,38,97,88,1,95,no,no,no,no,no,no,no,no,yes,no,yes,yes,no,no,no,no
Non-severe,CoV-085,23,Male,23,yes,yes,no,no,yes,no,no,no,no,,38,98,96,1,91,no,no,no,no,no,no,no,no,yes,yes,yes,no,no,yes,no,no
Non-severe,CoV-047,43,Male,25,yes,no,yes,no,yes,yes,yes,yes,no,no,38.5,98,96,1,100,yes,yes,no,no,yes,yes,yes,no,yes,yes,yes,yes,yes,no,yes,no
Non-severe,CoV-049,50,Female,25,yes,yes,yes,no,no,yes,no,no,no,no,,,,,,no,no,no,no,no,no,no,no,yes,no,yes,yes,yes,no,yes,no
Non-severe,CoV-058,45,Female,25,yes,yes,no,yes,yes,no,no,no,no,no,38.8,100,164,2,93,no,no,no,no,no,yes,no,no,yes,yes,yes,yes,no,no,no,no
Non-severe,CoV-086,43,Male,27,yes,yes,no,yes,no,no,yes,no,no,no,38.3,99,115,1,92,no,no,no,no,no,no,no,no,no,yes,yes,yes,no,no,no,no
Severe,CoV-090,59,Female,28,yes,yes,yes,yes,yes,yes,yes,yes,no,no,38.5,73,38,0,107,no,no,no,no,no,no,yes,no,yes,yes,yes,no,yes,no,yes,yes
Severe,CoV-073,33,Male,27,yes,yes,no,yes,yes,no,yes,no,no,yes,39,97,92,1,110,no,no,no,no,no,yes,yes,no,yes,yes,yes,yes,yes,yes,no,no
Non-severe,CoV-023,23,Male,16,no,yes,yes,no,no,no,no,no,no,no,38.3,99,160,2,102,no,no,no,no,no,yes,yes,no,no,yes,yes,yes,no,no,no,no
Non-severe,CoV-046,41,Male,23,yes,yes,no,yes,no,no,no,no,no,no,38.5,97,93,1,86,no,no,no,no,no,no,no,no,yes,yes,yes,yes,yes,no,no,no
Severe,CoV-055,67,Female,25,yes,yes,no,yes,yes,no,no,no,yes,no,38.5,99,151,1,102,yes,yes,yes,no,no,no,yes,no,yes,yes,yes,yes,yes,no,no,no
Non-severe,CoV-054,30,Female,18,yes,yes,no,yes,yes,no,no,no,yes,no,38.7,99,110,1,103,no,no,no,no,no,no,no,no,yes,yes,yes,yes,no,no,no,no
Severe,CoV-087,72,Female,22,yes,yes,no,yes,yes,no,yes,no,no,no,37.5,96,73,1,100,yes,yes,yes,yes,no,no,yes,no,yes,yes,no,yes,yes,yes,no,no
Non-severe,CoV-035,30,Female,17,yes,yes,yes,yes,no,yes,no,no,no,no,38.2,100,190,2,107,no,no,no,no,no,no,no,no,yes,yes,yes,yes,yes,no,no,no
Non-severe,CoV-089,50,Female,17,yes,yes,yes,no,no,no,no,no,no,yes,37.2,97,91,1,105,no,no,no,no,no,no,no,no,yes,no,yes,no,no,no,no,no
Non-severe,CoV-088,47,Male,17,yes,yes,no,no,no,no,no,no,no,no,36.8,94,72,1,97,no,no,no,no,no,no,no,no,yes,yes,no,yes,no,no,no,no
Non-severe,CoV-070,22,Male,18,no,no,no,no,no,no,no,no,no,no,37,98,99,1,100,no,no,no,no,no,no,no,no,yes,yes,no,yes,no,no,no,no
Severe,CoV-071,54,Male,28,yes,yes,yes,yes,yes,no,yes,no,yes,no,38.7,99,136,1,102,yes,yes,yes,no,no,yes,yes,no,yes,yes,yes,yes,yes,no,no,no
Non-severe,CoV-004,46,Female,11,yes,yes,yes,no,no,yes,no,no,no,no,37.6,98,107,1,100,no,no,no,no,no,no,no,no,no,no,no,no,yes,no,yes,no
Severe,CoV-077,53,Male,24,yes,yes,no,yes,yes,no,yes,no,no,no,38.4,98,101,1,102,yes,yes,no,no,no,yes,no,no,yes,yes,yes,no,yes,yes,yes,yes
Non-severe,CoV-012,41,Female,24,yes,yes,yes,no,no,no,no,no,no,no,38.4,99,138,1,105,yes,no,no,no,no,yes,no,no,yes,yes,yes,yes,no,no,no,no
Non-severe,CoV-019,20,Female,15,yes,yes,yes,no,no,yes,no,yes,no,yes,39.5,99,143,2,95,no,no,no,no,no,yes,yes,no,yes,yes,yes,no,no,no,no,no
Non-severe,CoV-033,69,Female,18,yes,yes,no,no,no,no,no,no,no,no,38.6,99,118,1,127,no,no,no,no,no,no,yes,no,yes,yes,yes,yes,no,no,no,no
Non-severe,CoV-009,45,Male,21,yes,no,no,no,no,no,no,no,no,no,36.5,99,135,1,101,no,no,no,no,yes,yes,yes,no,yes,yes,yes,no,yes,yes,no,no
Severe,CoV-068,81,Male,30,yes,yes,yes,yes,yes,no,yes,yes,no,no,38,95,75,1,115,no,no,no,no,no,yes,yes,yes,yes,yes,yes,yes,yes,yes,no,yes
Non-severe,CoV-011,51,Female,15,yes,no,no,no,yes,no,no,no,yes,no,36.5,99,145,1,97,no,no,no,no,no,no,yes,no,yes,yes,yes,yes,no,no,no,no
Non-severe,CoV-039,21,Female,22,yes,no,no,no,no,no,no,no,no,no,36.5,,,,,no,no,no,no,no,no,no,no,yes,no,yes,yes,no,no,no,no
Severe,CoV-048,53,Male,29,yes,yes,yes,yes,yes,no,yes,no,no,no,39,97,89,1,105,yes,yes,no,no,no,yes,yes,no,yes,yes,yes,yes,yes,yes,yes,no
Non-severe,CoV-036,82,Male,20,yes,no,no,yes,yes,no,no,no,no,no,36.9,95,73,1,107,no,no,no,yes,no,no,no,yes,yes,yes,yes,no,no,no,no,no
Severe,CoV-078,64,Male,27,yes,yes,yes,yes,no,no,yes,no,no,no,38,95,72,1,101,no,no,yes,no,no,yes,yes,no,no,yes,no,yes,yes,yes,yes,no
Non-severe,CoV-076,29,Male,12,yes,yes,no,no,no,no,no,no,no,no,38,99,139,1,96,no,no,no,no,no,no,no,no,yes,no,yes,yes,yes,no,no,no
Non-severe,CoV-031,32,Female,16,yes,yes,yes,yes,yes,no,yes,no,yes,no,39,98,95,1,108,no,no,no,no,no,no,no,no,yes,yes,yes,yes,no,yes,yes,no
Non-severe,CoV-018,41,Female,16,yes,yes,no,no,no,no,no,no,no,no,38.5,,,,,no,no,no,no,no,no,no,no,yes,yes,yes,yes,no,no,no,no
