Patient ID,Endpoint titer to SARS-CoV-2,Unnamed: 2,Avidity index (%) for SARS-CoV-2,Unnamed: 4,Cross-binding ,Unnamed: 6,Unnamed: 7,Unnamed: 8,Neutralization (ID50),Unnamed: 10,Unnamed: 11
,,,,,SARS-CoV,,MERS- CoV,,,,
,S1,S2,S1,S2,S1,S2,S1,S2,SARS-CoV-2,SARS-CoV,MERS-CoV
Severe group (n=17),,,,,,,,,,,
PT1,14960,81920,44,48,+,+,-,+,735,<30,<30
PT2,40960,655360,28,80,+,+,-,+,728,253,<30
PT3,40960,327680,22,46,+,+,-,+,2067,<30,35
PT4,40960,40960,54,63,+,+,-,+,1037,406,<30
PT5,40960,81920,59,63,+,+,-,+,686,<30,68
PT6,81920,327680,57,67,+,+,-,+,3397,476,<30
PT7,40960,327680,29,29,+,+,-,+,1750,73,<30
PT8,81920,327680,57,60,+,+,-,-,1316,518,<30
PT9,81920,655360,58,61,+,+,-,-,1625,98,<30
PT10,81920,163840,41,72,-,+,-,+,1881,328,<30
PT11,320,320,,,-,-,-,-,<30,<30,<30
PT12,40960,327680,21,66,-,+,-,+,3457,513,<30
PT13,81920,655360,26,60,-,+,-,+,1225,76,54
PT14,20480,327680,34,49,-,+,-,+,1898,30,<30
PT15,20480,40960,55,49,-,+,-,+,403,426,<30
PT16,40960,327680,30,29,-,+,-,+,495,249,<30
PT17,81920,327680,37,64,-,+,-,+,1149,149,35
Non-severe group (n=50),,,,,,,,,,,
PT18,20480,81920,37,70,+,+,-,+,218,409,<30
PT19,81920,81920,47,66,+,+,-,+,631,209,<30
PT20,40960,327680,44,77,+,+,-,+,859,160,<30
PT21,81920,81920,47,62,+,+,-,+,722,<30,<30
PT22,81920,81920,52,58,+,+,-,+,585,423,53
PT23,81920,655360,40,41,+,+,-,+,1006,398,<30
PT24,40960,40960,49,53,+,+,-,+,1673,133,<30
PT25,40960,20480,27,39,+,+,-,-,558,191,<30
PT26,81920,655360,37,49,+,+,-,-,3615,483,<30
PT27,20480,81920,40,55,+,+,-,+,1168,<30,<30
PT28,20480,81920,45,41,+,+,-,+,1214,<30,<30
PT29,20480,655360,26,70,+,+,-,+,269,<30,61
PT30,40960,163840,48,62,+,+,-,+,815,<30,49
PT31,81920,327680,47,55,+,+,-,+,576,376,<30
PT32,81920,327680,49,47,+,+,-,+,1395,141,<30
PT33,40960,327680,23,55,+,+,-,+,956,159,<30
PT34,40960,327680,15,58,+,+,-,+,2941,86,<30
PT35,20480,40960,52,68,-,+,-,+,100,70,<30
PT36,10240,81920,39,55,-,+,-,-,75,394,<30
PT37,2560,81920,66,90,-,+,-,+,332,486,<30
PT38,1280,5120,42,69,-,-,-,-,<30,<30,<30
PT39,5120,655360,58,95,-,+,-,+,344,136,<30
PT40,10240,20480,52,69,-,+,-,+,316,68,<30
PT41,20480,20480,32,49,-,+,-,-,90,380,<30
PT42,10240,81920,46,67,-,+,-,+,544,<30,<30
PT43,320,320,,,-,-,-,-,79,<30,<30
PT44,10240,40960,41,41,-,+,-,+,255,99,36
PT45,20480,81920,49,73,-,+,-,+,546,390,<30
PT46,40960,81920,48,55,-,+,-,+,282,39,<30
PT47,2560,81920,54,79,-,+,-,+,125,337,<30
PT48,320,320,,,-,-,-,+,42,309,<30
PT49,20480,40960,34,57,-,-,-,+,215,<30,<30
PT50,40960,81920,23,52,-,+,-,-,1395,169,<30
PT51,40960,327680,39,57,-,+,-,+,211,185,<30
PT52,40960,81920,41,52,-,+,-,+,813,<30,67
PT53,10240,81920,49,67,-,+,-,-,249,77,<30
PT54,40960,81920,51,42,-,+,-,-,452,<30,<30
PT55,40960,163840,27,44,-,+,-,+,540,188,<30
PT56,40960,327680,23,37,-,+,-,+,1433,420,272
PT57,2560,40960,49,51,-,+,-,+,395,248,34
PT58,5120,20480,56,61,-,-,-,-,113,440,<30
PT59,10240,163840,56,53,-,+,-,+,1389,416,<30
PT60,5120,5120,66,65,-,-,-,-,92,<30,<30
PT61,81920,81920,43,67,-,+,-,-,837,420,<30
PT62,10240,81920,56,62,-,+,-,+,335,47,<30
PT63,5120,81920,42,44,-,+,-,+,184,62,<30
PT64,5120,40960,48,71,-,+,-,-,139,44,<30
PT65,10240,81920,36,47,-,+,-,+,88,59,<30
PT66,10240,81920,50,66,-,+,-,-,151,54,<30
PT67,10240,40960,46,50,-,+,-,-,436,101,38
Healthy control(n=10),,,,,,,,,,,
HC1,ND,ND,,,-,-,-,-,<30,<30,<30
HC2,ND,ND,,,-,-,-,-,<30,<30,<30
HC3,ND,ND,,,-,-,-,-,<30,<30,<30
HC4,ND,ND,,,-,-,-,-,<30,<30,<30
HC5,ND,ND,,,-,-,-,-,<30,<30,<30
HC6,ND,ND,,,-,-,-,-,<30,<30,<30
HC7,ND,ND,,,-,-,-,-,<30,<30,<30
HC8,ND,ND,,,-,-,-,-,<30,<30,<30
HC9,ND,ND,,,-,-,-,-,<30,<30,<30
HC10,ND,ND,,,-,-,-,-,<30,<30,<30
