PID,Age,Gender,Country,Living_Area_type,Living_Place_type,Living_alone,Living_partner,Living_children,Living_sibling,Living_ext_fam,Living_friends,Living_other,Living_other_text,Living_with,Work_lost_job,Work_pay_cut,Work_still_working,Work_reduced_hours,Work_increased,Work_furlough,Work_furloughed_now_back,Work_other,Work_student,Not_working,Key_worker,GAD7_total,Engagement_ML_amount,Engagement_ML_importance,Social_ML_Sharewithothers,Social_ML_createplaylists
W2805,26.0,2.0,UK,2.0,1.0,,,,,1.0,,,,2.0,,,1.0,,,,,,,,2.0,5.0,3.0,3.0,3.0,2.0
R2616,20.0,1.0,Portugal,1.0,1.0,,,,1.0,,,,,2.0,,,1.0,,,,,,,,1.0,7.0,3.0,2.0,2.0,1.0
P0874,21.0,2.0,United Kingdom,3.0,1.0,,1.0,,,,,,,2.0,,,,,,1.0,,,,,2.0,3.0,3.0,2.0,2.0,2.0
5ea3c2788e994c34f6919a89,30.0,1.0,california,1.0,1.0,1.0,,,,,,,,1.0,,,1.0,,,,,,,,1.0,0.0,2.0,3.0,2.0,1.0
M1966,30.0,2.0,England,2.0,1.0,,1.0,1.0,,1.0,,,,2.0,,,,,1.0,,,,,,1.0,3.0,3.0,3.0,2.0,2.0
G2886,31.0,2.0,England,1.0,3.0,,,,,,1.0,,,2.0,,,1.0,,,,,,,,1.0,1.0,2.0,2.0,2.0,
M2023,20.0,2.0,scotland,1.0,3.0,,,,,1.0,,,,2.0,,,,,,1.0,,,,,2.0,0.0,3.0,2.0,1.0,2.0
J797,49.0,2.0,United Kingdom,3.0,1.0,,1.0,,,,,,,2.0,,,,,,,,1.0,,1.0,2.0,12.0,2.0,2.0,1.0,
66,25.0,2.0,United Kingdom,2.0,3.0,,1.0,,,,,,,2.0,,,,,,1.0,,,,,2.0,11.0,3.0,3.0,2.0,2.0
2997,22.0,2.0,Italy,3.0,3.0,,,,,1.0,,,,2.0,,,1.0,,,,,,,,2.0,8.0,2.0,2.0,1.0,1.0
R0386,21.0,1.0,México,1.0,1.0,,,,,1.0,,,,2.0,1.0,,,,,,,,,,2.0,9.0,3.0,1.0,2.0,2.0
P0513,20.0,1.0,Portugal,3.0,1.0,,,,,1.0,,,,2.0,,,1.0,,,,,,,,1.0,14.0,2.0,3.0,2.0,2.0
S2965,36.0,2.0,United Kingdom,3.0,3.0,,,1.0,,,,,,2.0,1.0,,,,,,,,,,1.0,2.0,3.0,3.0,2.0,2.0
B1928,21.0,3.0,Poland,4.0,3.0,,,,,1.0,,,,2.0,1.0,,,,,,,,,,2.0,10.0,3.0,2.0,3.0,2.0
W0476,18.0,2.0,england,4.0,1.0,,,,,,,1.0,parents and siblings,2.0,1.0,,,,,,,,,,2.0,17.0,3.0,2.0,3.0,2.0
P3049,18.0,1.0,Italy,4.0,1.0,,,,,1.0,,,,2.0,,,,,,,,1.0,1.0,,2.0,4.0,3.0,2.0,2.0,2.0
H1730,18.0,1.0,Israel,1.0,3.0,,,,,,,1.0,Living with mother.,2.0,1.0,,,,,,,,,,2.0,5.0,3.0,2.0,2.0,2.0
A987,33.0,2.0,Wales,1.0,3.0,,1.0,,,,,,,2.0,,1.0,,,,,,,,,2.0,7.0,2.0,2.0,2.0,2.0
R0167,20.0,1.0,Portugal,1.0,1.0,,,,1.0,1.0,,,,2.0,,,,,,,,1.0,1.0,,2.0,2.0,2.0,3.0,2.0,3.0
A0485,19.0,2.0,United Kingdom,1.0,3.0,,,,,1.0,,,,2.0,,,,,,,1.0,,,,2.0,13.0,3.0,3.0,3.0,
M2782,50.0,2.0,UK,2.0,1.0,,1.0,1.0,,,,,,2.0,,,,,,,,1.0,,1.0,2.0,2.0,3.0,2.0,2.0,2.0
L1784,35.0,2.0,United States,3.0,2.0,,,,,1.0,,,,2.0,,,1.0,,,,,,,,2.0,7.0,3.0,2.0,3.0,2.0
C0593,43.0,1.0,United Kingdom,3.0,1.0,,,1.0,,,,,,2.0,,,1.0,,,,,,,,1.0,7.0,3.0,3.0,2.0,2.0
B0117,21.0,1.0,Polska,3.0,1.0,,,,,1.0,,1.0,Świętokrzyskie,2.0,,,1.0,,,,,,,,2.0,8.0,2.0,2.0,2.0,2.0
B2858,40.0,2.0,UK,3.0,1.0,,1.0,1.0,,,,,,2.0,,,,,,,,1.0,,1.0,2.0,8.0,2.0,2.0,2.0,2.0
B1828,31.0,2.0,Uk,1.0,3.0,,1.0,,,,,,,2.0,,,,,,1.0,,,,,2.0,2.0,1.0,1.0,1.0,1.0
K2529,28.0,1.0,Poland,2.0,1.0,,,,,1.0,,,,2.0,,,1.0,,,,,,,,1.0,0.0,2.0,2.0,2.0,2.0
B57,18.0,1.0,Hungary,1.0,1.0,,1.0,,,,1.0,,,2.0,,,,,,1.0,,,,,2.0,14.0,3.0,1.0,3.0,1.0
A0123,22.0,1.0,Poland,3.0,1.0,,1.0,,,,,,,2.0,,,,,,1.0,1.0,,,,1.0,11.0,2.0,2.0,3.0,3.0
2485,35.0,2.0,Germany,1.0,3.0,,1.0,,,,,,,2.0,,,1.0,,,,,,,,2.0,4.0,2.0,2.0,1.0,1.0
F2059,38.0,2.0,England,3.0,1.0,,1.0,1.0,,,,,,2.0,,,1.0,,,,,,,,1.0,6.0,2.0,2.0,2.0,
mj1969,51.0,2.0,United Kingdom,1.0,1.0,1.0,,,,,,,,1.0,,,,,,1.0,,,,,2.0,3.0,1.0,1.0,1.0,
R0289,19.0,2.0,The Netherlands,1.0,1.0,,,,,1.0,,,,2.0,,,,,,,,1.0,,1.0,2.0,3.0,3.0,2.0,3.0,2.0
G1874,23.0,2.0,Canada,1.0,1.0,,,,,1.0,,,,2.0,1.0,,,,,,,,,,2.0,15.0,1.0,2.0,3.0,2.0
C1336,25.0,2.0,Ireland,3.0,1.0,1.0,,,,,,,,1.0,,,1.0,,,,,,,,1.0,2.0,3.0,2.0,2.0,
B0723,19.0,2.0,South Africa,1.0,1.0,,,,1.0,1.0,,,,2.0,1.0,,,,,,,,,,2.0,7.0,1.0,3.0,1.0,
T1996,19.0,1.0,USA,1.0,1.0,,,,,1.0,,,,2.0,,,,,1.0,,,,,,2.0,7.0,3.0,2.0,1.0,3.0
S2953,50.0,2.0,Uk,1.0,1.0,,1.0,,,,,,,2.0,,,1.0,,,,,,,,2.0,6.0,3.0,2.0,2.0,2.0
B1981,30.0,2.0,Wales,4.0,1.0,,1.0,1.0,,,,,,2.0,,,1.0,1.0,,,,,,,1.0,10.0,3.0,3.0,2.0,2.0
L1308,60.0,2.0,Portugal,4.0,1.0,,1.0,,,,,,,2.0,,,1.0,,,,,,,,1.0,10.0,1.0,3.0,1.0,1.0
L1710,20.0,1.0,Hungary,4.0,1.0,,,,,1.0,,,,2.0,,,,1.0,,,,,,,1.0,8.0,2.0,3.0,1.0,2.0
C0458,22.0,2.0,Portugal,1.0,3.0,,,,,1.0,,,,2.0,,,1.0,,,,,,,,1.0,14.0,2.0,3.0,2.0,2.0
N0943,40.0,1.0,Portugal,1.0,3.0,,1.0,1.0,,1.0,,,,2.0,,,1.0,,,,,,,,2.0,6.0,3.0,3.0,3.0,2.0
S2496,34.0,1.0,United Kingdom,2.0,1.0,,1.0,1.0,,,,,,2.0,,1.0,,,,,1.0,,,,2.0,0.0,2.0,2.0,2.0,2.0
M2439,36.0,2.0,Spain,1.0,3.0,,,1.0,,,,,,2.0,1.0,,,,,,,,,,2.0,3.0,3.0,3.0,3.0,2.0
Bz22,27.0,2.0,United Kingdom,1.0,3.0,,1.0,,,,,,,2.0,,,1.0,,,,,,,,1.0,2.0,2.0,2.0,2.0,2.0
P0262,31.0,3.0,Chile,1.0,1.0,,,,,,,1.0,Living with parent,2.0,,,,1.0,,,,,,,1.0,5.0,2.0,2.0,2.0,2.0
B2237,37.0,2.0,Portugal,1.0,3.0,,1.0,1.0,,,,,,2.0,,,1.0,,,,,,,,2.0,0.0,1.0,2.0,2.0,2.0
G0825,22.0,2.0,Greece,2.0,3.0,,,,,1.0,,,,2.0,,,,1.0,,,,,,,2.0,10.0,2.0,2.0,3.0,2.0
VEN1063,25.0,1.0,Portugal,5.0,1.0,1.0,,,,,,,,1.0,,,,,,,,1.0,,1.0,2.0,4.0,2.0,2.0,2.0,2.0
G2402,27.0,2.0,United Kingdom,1.0,1.0,,,,,1.0,,,,2.0,,,,1.0,,,,,,,1.0,9.0,2.0,2.0,2.0,2.0
C2385,35.0,2.0,UK,4.0,1.0,,1.0,1.0,,,,,,2.0,,,1.0,,,,,,,,1.0,5.0,3.0,2.0,2.0,
O3087,28.0,1.0,England,1.0,1.0,,,,,,1.0,,,2.0,,,1.0,,,,,,,,2.0,18.0,3.0,3.0,3.0,3.0
F2213,23.0,1.0,Portugal,1.0,3.0,,,,,1.0,,,,2.0,,,1.0,,,,,,,,2.0,17.0,1.0,2.0,2.0,2.0
H1744,22.0,1.0,Czech republic,1.0,3.0,,1.0,,,,,,,2.0,,,1.0,,,,,,,,1.0,4.0,3.0,3.0,1.0,2.0
P1850,40.0,2.0,Spain,1.0,3.0,,1.0,,,,,,,2.0,,,,,,,,1.0,,1.0,1.0,5.0,2.0,2.0,2.0,2.0
C0443,18.0,2.0,Ireland,6.0,1.0,,,,1.0,,,,,2.0,,,,,,,,1.0,1.0,,2.0,10.0,3.0,3.0,3.0,2.0
11,40.0,2.0,Poland,1.0,3.0,,1.0,1.0,,,,,,2.0,,,1.0,,,,,,,,2.0,2.0,1.0,1.0,1.0,1.0
S0679,32.0,2.0,Italy,3.0,1.0,1.0,,,,,,,,1.0,,,,,1.0,,,,,,1.0,9.0,2.0,2.0,2.0,
c3164,30.0,2.0,Alemanha,1.0,3.0,,1.0,1.0,,,,,,2.0,,,1.0,,,,,,,,1.0,0.0,2.0,2.0,2.0,2.0
man199045,29.0,2.0,United Kingdom,1.0,1.0,,1.0,,,,,,,2.0,,,,1.0,,,,,,,2.0,0.0,2.0,2.0,2.0,2.0
M1634,34.0,1.0,gREECE,2.0,3.0,,1.0,,,,,,,2.0,,,1.0,,,,,,,,1.0,4.0,2.0,2.0,2.0,2.0
J1740,29.0,2.0,Portugal,2.0,1.0,,,,,,,1.0,Parents,2.0,,,,,,,1.0,1.0,,,2.0,9.0,1.0,2.0,2.0,1.0
L0685,19.0,2.0,Portugal,1.0,1.0,,,,,1.0,,,,2.0,,,,,,,,1.0,1.0,,2.0,10.0,1.0,2.0,3.0,2.0
R0677,21.0,1.0,United States,1.0,3.0,,,,,,,1.0,Living with family,2.0,,,1.0,,,,,,,,2.0,0.0,2.0,2.0,2.0,2.0
M1475,20.0,1.0,Italia,1.0,1.0,,1.0,,,,,,,2.0,1.0,,,,,,,,,,2.0,3.0,1.0,3.0,1.0,1.0
m2114,50.0,2.0,United Kingdom,1.0,1.0,,,1.0,,,,,,2.0,,,,,,,,1.0,,1.0,2.0,18.0,2.0,2.0,2.0,2.0
G1171,60.0,1.0,Portugal,3.0,1.0,,1.0,,,,,,,2.0,,,1.0,,,,,,,,1.0,7.0,1.0,2.0,2.0,2.0
P0210,33.0,1.0,Estonia,1.0,3.0,,,1.0,,,,,,2.0,,1.0,,1.0,,,,,,,1.0,2.0,3.0,2.0,2.0,2.0
N0578,25.0,1.0,Chile,1.0,1.0,,,,,1.0,,,,2.0,,,,1.0,,,,,,,1.0,5.0,1.0,2.0,2.0,
C0825,26.0,2.0,Spain,1.0,2.0,,,,,,1.0,,,2.0,,,,,,,,1.0,,1.0,2.0,7.0,3.0,3.0,3.0,
A0756,21.0,1.0,Chile,1.0,3.0,,,,,1.0,,,,2.0,,,,,,,,1.0,1.0,,1.0,12.0,1.0,2.0,2.0,2.0
O0909,18.0,2.0,The Netherlands,1.0,1.0,,,,,,,1.0,with parents,2.0,,,,1.0,,,,,,,2.0,1.0,3.0,2.0,3.0,2.0
G1288,23.0,2.0,Poland,1.0,3.0,,1.0,,,,,,,2.0,,,,1.0,,,,,,,1.0,14.0,3.0,2.0,2.0,
C0699,20.0,2.0,The Netherlands,1.0,2.0,,1.0,,,,,,,2.0,,,,,,,,1.0,1.0,,2.0,11.0,2.0,2.0,2.0,
W1509,25.0,2.0,Canada,1.0,1.0,,,,,,,1.0,Living with immediate family (parents),2.0,,,,1.0,,,,,,,2.0,6.0,2.0,3.0,3.0,2.0
K0969,53.0,1.0,Poland,2.0,3.0,,1.0,,,,,,,2.0,,,1.0,,1.0,,,,,,1.0,2.0,1.0,2.0,1.0,1.0
S0155,23.0,1.0,Poland,1.0,3.0,,,,,1.0,,,,2.0,,1.0,,,,,,,,,2.0,1.0,3.0,3.0,3.0,2.0
K1132,49.0,2.0,Greece,2.0,3.0,,,1.0,,,,,,2.0,,,,,1.0,,,,,,2.0,8.0,2.0,2.0,2.0,2.0
G0995,32.0,2.0,England,3.0,1.0,,,,,1.0,,,,2.0,1.0,,,,,,,,,,2.0,10.0,3.0,1.0,1.0,1.0
K2282,21.0,2.0,Poland,3.0,3.0,,,,1.0,,,,,2.0,,,,,,,,1.0,,1.0,2.0,10.0,3.0,3.0,2.0,2.0
R0438,20.0,2.0,Chile,1.0,1.0,,,,,1.0,,,,2.0,1.0,,,,,,,,,,2.0,8.0,2.0,3.0,3.0,1.0
MP0330,21.0,1.0,Portugal,1.0,2.0,1.0,,,,,,,,1.0,,,,1.0,,,,,,,1.0,9.0,3.0,3.0,3.0,
g2251,36.0,1.0,México,1.0,1.0,,1.0,,,,,,,2.0,,,,1.0,,,,,,,1.0,0.0,2.0,3.0,1.0,1.0
G2974,34.0,2.0,mexico,1.0,3.0,,1.0,,,,,,,2.0,1.0,,,,,,,,,,2.0,8.0,3.0,3.0,1.0,
M0974,20.0,2.0,Poland,1.0,1.0,1.0,,,,,,,,1.0,,,1.0,,,,,,,,2.0,8.0,3.0,3.0,2.0,2.0
V0412,25.0,1.0,México,1.0,1.0,,,,,1.0,,,,2.0,1.0,,,,,,,,,,2.0,14.0,3.0,3.0,3.0,3.0
F3199,41.0,2.0,Italy,1.0,3.0,,1.0,,,,,,,2.0,,,,,,,,1.0,,,2.0,5.0,3.0,3.0,2.0,1.0
P1336,18.0,2.0,Portugal,1.0,1.0,,,,,1.0,,,,2.0,,,,,,,,1.0,1.0,,2.0,11.0,1.0,2.0,3.0,2.0
S0963,23.0,1.0,Poland,2.0,1.0,,1.0,,,,,,,2.0,,,,1.0,,,,,,,1.0,10.0,3.0,3.0,3.0,3.0
T0552,20.0,1.0,Portugal,3.0,1.0,,,,,1.0,,,,2.0,,,1.0,,,,,,,,2.0,10.0,3.0,2.0,3.0,2.0
63,23.0,1.0,Poland,2.0,1.0,,1.0,,,,,,,2.0,,,,1.0,,,,,,,1.0,8.0,3.0,3.0,3.0,3.0
F0374,27.0,2.0,United Kingdom,1.0,1.0,1.0,,,,,,,,1.0,,,,,1.0,,,,,,1.0,19.0,3.0,3.0,2.0,2.0
M1179,22.0,2.0,Portugal,1.0,3.0,,1.0,,,,,,,2.0,,,1.0,,,,,,,,1.0,14.0,2.0,3.0,2.0,2.0
F1685,28.0,1.0,Portugal,1.0,3.0,,,,,1.0,,,,2.0,,,1.0,1.0,,,,,,,2.0,5.0,3.0,3.0,2.0,2.0
B0177,44.0,2.0,UK,3.0,1.0,,,1.0,,,,,,2.0,,,,1.0,,,,,,,2.0,16.0,3.0,3.0,3.0,3.0
F2186,48.0,2.0,Uk,3.0,1.0,,,1.0,,,,,,2.0,,,,,,,1.0,,,,1.0,10.0,3.0,3.0,1.0,1.0
M1667,22.0,2.0,Portugal,3.0,1.0,,,,,,,1.0,living with parents,2.0,,,,,,,,1.0,1.0,,2.0,2.0,3.0,2.0,2.0,2.0
F2195,28.0,1.0,United Kingdom,2.0,1.0,,1.0,,,,,,,2.0,,,,,,,,1.0,,1.0,2.0,9.0,2.0,2.0,2.0,2.0
M0552,33.0,2.0,United Kingdom,4.0,1.0,,1.0,,,,,,,2.0,,,1.0,,,,,,,,2.0,8.0,3.0,2.0,2.0,
P1016,30.0,1.0,Estonia,1.0,3.0,,1.0,1.0,,,,,,2.0,,,1.0,,1.0,,,,,,1.0,3.0,1.0,3.0,1.0,1.0
K1368,24.0,2.0,United Kingdom,1.0,1.0,,,,,1.0,,,,2.0,,,1.0,,,,,,,,1.0,6.0,1.0,2.0,2.0,2.0
F2721,45.0,2.0,England,2.0,3.0,1.0,,,,,,,,1.0,,,,,,,,1.0,,1.0,2.0,10.0,3.0,3.0,2.0,2.0
L1853,22.0,1.0,Italy,3.0,1.0,,,,,1.0,,,,2.0,,,,1.0,,,,,,,2.0,7.0,3.0,2.0,3.0,2.0
R1341,20.0,1.0,Uk,1.0,1.0,,,,,1.0,,,,2.0,,,,,,,1.0,,,,1.0,8.0,1.0,1.0,3.0,1.0
T3076,21.0,1.0,South Africa,1.0,3.0,,,,,1.0,,,,2.0,,,,,,1.0,,,,,2.0,7.0,3.0,3.0,2.0,2.0
M0453,31.0,1.0,New Zealand,1.0,3.0,,1.0,,,,,,,2.0,,,,1.0,,,,,,,2.0,9.0,2.0,2.0,2.0,3.0
P0312,18.0,1.0,United Kingdom,1.0,1.0,,,,,1.0,,,,2.0,,,1.0,,1.0,,,,,,1.0,7.0,3.0,2.0,1.0,2.0
5eaefd5d29cb520856a94189,25.0,1.0,Chile,1.0,1.0,,,,,1.0,,,,2.0,,,,,,,,1.0,1.0,,2.0,6.0,3.0,2.0,2.0,2.0
N1223,57.0,2.0,UNITED KINGDOM,2.0,1.0,1.0,,,,,,,,1.0,,,,,,,,1.0,,,2.0,5.0,3.0,3.0,1.0,1.0
O0589,27.0,2.0,France,2.0,3.0,,1.0,,,,,,,2.0,1.0,,,,,,,,,,1.0,15.0,1.0,1.0,2.0,2.0
M1984,40.0,2.0,England,1.0,1.0,,,1.0,,,,,,2.0,,,,,,1.0,,,,,1.0,7.0,3.0,3.0,1.0,
A3008,28.0,2.0,France,1.0,3.0,,,,,1.0,,,,2.0,,,,,,,,1.0,,1.0,2.0,1.0,2.0,2.0,1.0,1.0
m728,62.0,2.0,United Kingdom,3.0,1.0,,1.0,,,,,,,2.0,,,,,,,,1.0,,1.0,2.0,0.0,3.0,2.0,2.0,
J1004,18.0,2.0,USA,3.0,1.0,,,,,,,1.0,Living w immediate family,2.0,1.0,,,,,,,,,,2.0,19.0,3.0,3.0,3.0,2.0
F1855,30.0,1.0,Portugal,1.0,3.0,,1.0,,,,,,,2.0,1.0,,,,,,,,,,1.0,7.0,3.0,3.0,3.0,
R602,22.0,1.0,Estonia,1.0,1.0,,,,,1.0,,,,2.0,,,1.0,,,,,,,,2.0,0.0,2.0,2.0,2.0,2.0
D0282,26.0,2.0,Wales,1.0,1.0,,1.0,,,,,,,2.0,,,1.0,,,,,,,,1.0,14.0,3.0,3.0,1.0,
B2444,25.0,2.0,Mexico,1.0,1.0,,,,,,,1.0,living with parents,2.0,,,,1.0,,,,,,,1.0,4.0,2.0,2.0,2.0,2.0
C1644,28.0,2.0,UK,3.0,1.0,,1.0,,,,,,,2.0,,,1.0,,,,,,,,2.0,9.0,3.0,3.0,2.0,2.0
B0152,21.0,1.0,Netherlands,2.0,1.0,,,,1.0,1.0,,,,2.0,1.0,,,,,,,,,,2.0,0.0,2.0,2.0,2.0,
H2662,55.0,1.0,England,3.0,1.0,,1.0,1.0,,,,,,2.0,,,1.0,,,,,,,,2.0,5.0,1.0,2.0,2.0,
M0139,27.0,1.0,Chile,2.0,1.0,,,,,1.0,,,,2.0,,,,,,,,1.0,,1.0,2.0,3.0,1.0,1.0,2.0,2.0
W1557,46.0,2.0,United Kingdom,2.0,1.0,,1.0,1.0,,,,,,2.0,,,,,,,,1.0,,1.0,2.0,3.0,2.0,2.0,2.0,2.0
F2351,38.0,2.0,Uk,1.0,1.0,,,1.0,,,,,,2.0,,,,,,1.0,,,,,2.0,6.0,2.0,2.0,2.0,2.0
C3136,35.0,1.0,UK,1.0,1.0,1.0,,,,,,,,1.0,,,1.0,,,,,,,,2.0,7.0,3.0,3.0,2.0,1.0
A0123,22.0,1.0,Poland,3.0,2.0,,1.0,,,,,,,2.0,,1.0,,,,,,,,,1.0,8.0,2.0,2.0,3.0,1.0
M2090,23.0,2.0,United Kingdom,1.0,3.0,1.0,,,,,,,,1.0,,,1.0,,,,,,,,1.0,5.0,2.0,2.0,2.0,2.0
A2920,51.0,1.0,Spain,1.0,3.0,,1.0,,,,,,,2.0,,,1.0,,,,,,,,2.0,4.0,2.0,2.0,2.0,
Z1878,23.0,1.0,Poland,1.0,3.0,,,,1.0,1.0,,,,2.0,,,,,,,,1.0,,1.0,2.0,10.0,2.0,1.0,2.0,2.0
S1476,49.0,2.0,Switzerland,3.0,3.0,,1.0,1.0,,,,,,2.0,,,1.0,,,,,1.0,,,2.0,11.0,2.0,2.0,2.0,2.0
A2534,20.0,2.0,Spain,3.0,1.0,,,,,1.0,,,,2.0,1.0,,,,,,,,,,2.0,16.0,3.0,2.0,3.0,2.0
BM1753,24.0,1.0,Netherlands,4.0,1.0,1.0,,,,,,,,1.0,,,1.0,,,,,,,,2.0,14.0,3.0,3.0,2.0,2.0
G0767,29.0,1.0,Greece,1.0,3.0,,,,1.0,1.0,,,,2.0,,,,1.0,,,,,,,1.0,7.0,3.0,2.0,2.0,2.0
R0450,30.0,2.0,Mexico,1.0,1.0,,1.0,,,,,,,2.0,,,1.0,,,,,,,,2.0,7.0,3.0,3.0,2.0,2.0
C3069,20.0,1.0,Portugal,3.0,3.0,,,,,1.0,,,,2.0,,,1.0,,,,,,,,2.0,9.0,3.0,2.0,2.0,2.0
w1393,30.0,2.0,poland,1.0,1.0,,1.0,1.0,,1.0,,,,2.0,,,1.0,,,,,,,,1.0,2.0,2.0,2.0,2.0,2.0
A0458,22.0,2.0,Portugal,1.0,3.0,,,,,1.0,,,,2.0,,,1.0,,,,,,,,1.0,15.0,2.0,2.0,2.0,2.0
T0869,23.0,1.0,Mexico,1.0,1.0,,,,,1.0,,,,2.0,,,1.0,,1.0,,,,,,2.0,4.0,3.0,2.0,1.0,2.0
L0271,38.0,2.0,Portugal,1.0,3.0,,1.0,1.0,,,,,,2.0,,,1.0,,,,,,,,1.0,6.0,3.0,3.0,1.0,1.0
K2986,55.0,2.0,Polska,3.0,1.0,,1.0,,,,,,,2.0,,,,,,,,1.0,,1.0,2.0,1.0,2.0,2.0,2.0,2.0
W0805,22.0,1.0,Poland,3.0,3.0,,,,1.0,,,,,2.0,,,1.0,,,,,,,,2.0,5.0,3.0,2.0,3.0,2.0
JL2313,19.0,1.0,Portugal,1.0,1.0,,,,,1.0,,,,2.0,,,,1.0,,,,,,,2.0,3.0,2.0,3.0,1.0,1.0
O1576,63.0,2.0,Canada,3.0,1.0,,1.0,,,,,,,2.0,,,,,,,,1.0,,1.0,2.0,5.0,3.0,3.0,2.0,2.0
Y126,57.0,2.0,United Kingdom,4.0,1.0,,1.0,1.0,,,,,,2.0,,,,1.0,,,,,,,2.0,21.0,3.0,3.0,3.0,2.0
R1150,26.0,1.0,Slovenia,1.0,3.0,,1.0,,,,,,,2.0,,,1.0,,,,,,,,2.0,1.0,1.0,2.0,3.0,2.0
e.k. A2524,20.0,1.0,Poland,3.0,1.0,1.0,,,,,1.0,,,2.0,1.0,,1.0,,,,,,,,2.0,4.0,2.0,2.0,1.0,1.0
D2063,26.0,1.0,USA,1.0,3.0,,,1.0,,,,,,2.0,,,1.0,,,,,,,,1.0,8.0,2.0,2.0,2.0,2.0
D27348,37.0,2.0,Ireland,2.0,1.0,,1.0,1.0,,,,,,2.0,,,,,,,,1.0,,1.0,2.0,8.0,3.0,3.0,2.0,2.0
tysia,42.0,2.0,Poland,3.0,3.0,,,,,1.0,,,,2.0,,,1.0,,,,,,,,2.0,9.0,2.0,2.0,2.0,
S0503,25.0,1.0,Chile,3.0,1.0,,,,1.0,,,,,2.0,,,,,,,,1.0,1.0,,2.0,4.0,3.0,2.0,2.0,3.0
M2809,23.0,2.0,Italia,2.0,3.0,,,,,1.0,,,,2.0,,,,,,,,1.0,1.0,,2.0,6.0,2.0,2.0,2.0,2.0
5e524ae02cfcc325a4000274,27.0,1.0,Wales/United Kingdom,2.0,2.0,,,,,,,1.0,"Living with housemates, no association",2.0,,,,,1.0,,,,,,2.0,0.0,3.0,3.0,2.0,
A1077,26.0,1.0,Chile,2.0,1.0,,1.0,,,,,,,2.0,,,,1.0,,,,,,,1.0,13.0,1.0,1.0,1.0,3.0
A2519,27.0,2.0,Portugal,1.0,1.0,,,,,1.0,,,,2.0,,,,,,,,1.0,1.0,,2.0,20.0,3.0,3.0,2.0,
B1845,39.0,2.0,England,1.0,3.0,,1.0,1.0,,,,,,2.0,,,1.0,,,,,,,,2.0,15.0,3.0,3.0,1.0,1.0
H0814,25.0,2.0,Canada,1.0,1.0,1.0,,,,,,,,1.0,,,1.0,,,,,,,,2.0,2.0,3.0,3.0,3.0,3.0
M0135,24.0,2.0,Greece,1.0,3.0,1.0,,,,,,,,1.0,,,,,,,,1.0,1.0,,2.0,13.0,3.0,3.0,3.0,
A0455,18.0,1.0,poland,1.0,3.0,1.0,,,,,,,,1.0,,,,,,,,1.0,1.0,,2.0,2.0,2.0,2.0,2.0,2.0
J.B. A3005,18.0,1.0,Nederland,2.0,1.0,,,1.0,,,,,,2.0,,,,,,,1.0,,,,1.0,2.0,3.0,2.0,1.0,1.0
C1959,40.0,2.0,Spain,2.0,3.0,,1.0,,,1.0,,,,2.0,,,,1.0,,,,,,,2.0,6.0,1.0,1.0,3.0,2.0
C2067,18.0,1.0,Portugal,1.0,1.0,,,,,1.0,,,,2.0,1.0,,,,,,,,,,2.0,3.0,3.0,2.0,3.0,2.0
b1852,35.0,2.0,portugal,1.0,3.0,,1.0,,,,,,,2.0,,,,1.0,,,,,,,1.0,3.0,3.0,2.0,2.0,2.0
X2433,25.0,1.0,Canada,3.0,3.0,1.0,,,,,,,,1.0,1.0,,,,,,,,,,2.0,2.0,2.0,2.0,2.0,2.0
G2119,27.0,1.0,Poland,1.0,3.0,,,,,,,1.0,living with parent,2.0,,,1.0,,,,,,,,2.0,8.0,3.0,3.0,2.0,
R1917,26.0,2.0,USA,2.0,3.0,,,,,1.0,,,,2.0,,,,1.0,,,,,,,1.0,6.0,3.0,2.0,3.0,3.0
K1682,50.0,2.0,Uk,1.0,1.0,1.0,,,,,,,,1.0,,,,,,,,1.0,,1.0,1.0,6.0,2.0,2.0,3.0,3.0
B2563,,2.0,UK,1.0,1.0,,1.0,1.0,,,,,,2.0,,,1.0,,1.0,,,,,,2.0,8.0,2.0,2.0,2.0,
A1101,32.0,2.0,Turkey,1.0,3.0,,1.0,,,,,,,2.0,,1.0,1.0,,,,,,,,2.0,3.0,3.0,3.0,3.0,
K0518,24.0,2.0,UK,1.0,3.0,,1.0,,,,,,,2.0,,,1.0,,,,,1.0,1.0,,2.0,4.0,3.0,3.0,3.0,3.0
FS1068,22.0,2.0,England,1.0,3.0,,1.0,,,,1.0,,,2.0,,,,,,1.0,,,,,2.0,3.0,3.0,1.0,2.0,
M3066,25.0,2.0,England,1.0,3.0,,1.0,,,,,,,2.0,,,1.0,,,,,,,,2.0,5.0,1.0,1.0,1.0,
XXXX,48.0,2.0,United Kingdom,3.0,1.0,,1.0,1.0,,,,,,2.0,,,1.0,,,,,,,,2.0,13.0,3.0,3.0,2.0,
P159,23.0,2.0,England,2.0,3.0,,1.0,,,,,,,2.0,,,1.0,,,,,,,,2.0,3.0,3.0,1.0,2.0,2.0
F0385,30.0,2.0,USA,3.0,1.0,,1.0,,,,,,,2.0,,,,1.0,,,,,,,1.0,15.0,2.0,3.0,2.0,2.0
B1995,22.0,1.0,Wales,4.0,1.0,,1.0,,,,,,,2.0,,,,,,,,1.0,1.0,,2.0,13.0,2.0,2.0,2.0,2.0
G3140,29.0,2.0,England,2.0,1.0,,1.0,,,,,,,2.0,,,1.0,,,,,,,,2.0,0.0,2.0,2.0,3.0,
040793,31.0,2.0,UK,1.0,2.0,,,,,,,1.0,Living with housemates,2.0,,,1.0,,,,,,,,2.0,0.0,1.0,1.0,2.0,2.0
J1635,42.0,2.0,Northern Ireland,2.0,1.0,,1.0,1.0,,,,,,2.0,,,1.0,,,,,,,,1.0,11.0,1.0,3.0,1.0,2.0
T1141,58.0,2.0,Northern Ireland,2.0,1.0,,1.0,,,,,,,2.0,,,,1.0,,,,1.0,,,2.0,17.0,3.0,3.0,1.0,
F0101,32.0,1.0,uk,1.0,1.0,,1.0,,,,,,,2.0,,,,1.0,,,,1.0,,,2.0,7.0,1.0,2.0,3.0,
K0777,26.0,2.0,England,1.0,2.0,,,,,,1.0,,,2.0,,,1.0,,,,,,,,2.0,8.0,2.0,3.0,2.0,
V2193,32.0,2.0,Australia,1.0,1.0,,1.0,1.0,,,,,,2.0,,,1.0,,,,,,,,2.0,5.0,1.0,2.0,2.0,
C2054,48.0,2.0,United Kingdom,1.0,1.0,1.0,,1.0,,,,,,2.0,1.0,,,,,,,,,,2.0,4.0,1.0,2.0,1.0,2.0
R217,25.0,2.0,Uk,3.0,1.0,,1.0,,,,,,,2.0,,,1.0,,,,,,,,2.0,12.0,1.0,2.0,1.0,
N1331,54.0,2.0,Australia,1.0,1.0,,1.0,,,,,,,2.0,,,1.0,,1.0,,,,,,2.0,15.0,1.0,3.0,1.0,2.0
05,43.0,3.0,Australia,1.0,1.0,,,,,,,1.0,living with husband and children,2.0,,,,1.0,,,,,,,2.0,1.0,1.0,2.0,1.0,
K2620,66.0,1.0,U. K.,1.0,3.0,,1.0,,,,,,,2.0,,,1.0,,,,,,,,2.0,1.0,2.0,2.0,2.0,2.0
M0964,37.0,2.0,Serbia,1.0,3.0,,,1.0,,,,,,2.0,,,1.0,,1.0,,,,,,1.0,10.0,1.0,2.0,1.0,2.0
S0802,47.0,2.0,Serbia,2.0,3.0,,1.0,1.0,,,,,,2.0,,,1.0,,,,,,,,1.0,6.0,3.0,2.0,2.0,2.0
M1009,42.0,2.0,England,1.0,3.0,1.0,,,,,,,,1.0,,,,,,,,1.0,,1.0,2.0,9.0,3.0,3.0,3.0,
B0305,41.0,2.0,UK,1.0,1.0,,1.0,,,,,,,2.0,,,1.0,,,,,,,,2.0,3.0,2.0,2.0,2.0,2.0
S1464,44.0,2.0,USA,1.0,3.0,1.0,,,,,,,,1.0,,,1.0,,,,,,,,2.0,1.0,1.0,2.0,2.0,2.0
S1824,45.0,1.0,England,1.0,1.0,,1.0,,,,,,,2.0,,,1.0,,,,,,,,2.0,1.0,3.0,2.0,3.0,2.0
G2579,36.0,1.0,England,2.0,3.0,,1.0,,,,,,,2.0,,,,,,,,1.0,1.0,,2.0,20.0,2.0,2.0,2.0,2.0
U1616,26.0,2.0,UK,1.0,1.0,,,,,,,1.0,With family,2.0,,,1.0,,,,,,,,2.0,0.0,2.0,2.0,2.0,2.0
,,,,,,,,,,,,,,,,,,,,,,,,,,,,,,
,,,,,,,,,,,,,,,,,,,,,,,,,,,,,,
,,,,,,,,,,,,,,,,,,,,,,,,,,,,,,
