﻿Carimbodedatahora,VoceconcordacomostermosexpostosnoTCLEacima,VoceentregouumaviadoTCLEaopacienteemanteveumaviaassi_A,VoceentregouumaviadoTCLEaopacienteemanteveumaviaassi,OpacienteemquestaoeSUSPEITOouCONFIRMADOparaCOVID19,IdentificacaodopacientePreenchaestecampocomasIniciaisd,RGCT,CidadeeEstadoAtual,Regiaodopais,IniciaisdoPaciente,Sexodoreceptor,Datadenascimentodoreceptor,idadereceptor,≥60,Etniadoreceptor,PesodoReceptornomomentodotransplantekg,Alturadoreceptornomomentodotransplantecm,IMCdoreceptornomomentodotransplante,Motivoparaotransplantehepaticomarquetodasqueseenquadra,Datadotransplante,Tempo_Desde_TX,LocaldoTransplanteHospitalEquipe,Orgaotransplantadosimultaneamenteouaposofigadomarquetod,AntecedentesPessoaisdoReceptormarquetodosospresentes,Usodemedicacoesantihipertensivas,Tabagismoatualouprevio,Cardiopatia,Diabetes,Dislipidemia,Doenca_Autoimune,DRC,Hipertensao,Hipotireoidismo,Neoplasia_atual_ou_pregressa,Obesidade,Pneumopatia_previa,Transplante_renal_previo,SintomassugestivosdeCOVIDmarquetodosospresentes,Nauseas_vomito,Odinofagia,Sinais_neurologicos,Tosse,Artralgia,Dor_abdominal,Espirros,Espectoracao,Hipoxemia,Adinamia,Outros,Fadiga,Alt_olfato,Febre,Mialgia,Alt_paladar,Anorexia,Assintomatico,Calafrios,Cefaleia,Congestao_nasal,Coriza,Diarreia,Dispneia,Dor_toracica,SinaisesintomasdeCOVID19quesurgiramnaevolucaodadoenca,Datadoiniciodossintomas,Dataemqueopacientebuscouservicosdesaude,Tempo_busca_SV_Saude,Tempo_para_testagem_COVID,Tempo_entre_sintomas_e_internacao,DatadarealizacaodotesteconfirmatorioCOVID19,Onda_COVID,Datadainternacao,KAPLANMEIER_T_Sintoma_ate_obito,KAPLANMEIER_T_Diag_ate_obito,TestesrealizadosparaCOVID,Tratamento,UTI,NumerodediasemUTICTIsenaohouveinternacaoemUTImar,Numerodediasemintubacaoorotraquealsenaohouveintubacao,Tempoentreiniciodossintomasecomecodotratamentodias,TempodetratamentocomterapiasespecificasparaCOVID19dias,DesfechoPrincipaldopaciente,DatadoObitosepacientevivonaopreencher,Tempo_de_seguimento_dias,Necessidadedeventilacaomecanicanainternacao,Datadaintubacaoorotraquealsenaohouveintubacaonaopreen,Necessidadedehemodialiseainternacao,Regimedeimunossupressao,AZA,CsA,EVR,PRED,SIROLIMUS,TAC,MFS,MMF,ComoforamconduzidososimunossupressoresduranteadoencaMa,Com_vs_sem_alt_imunossupressao,ForaminstituidostratamentosespecificosparaCOVID19,Com_vs_sem_tratamento,UsodeterapiacomcorticoesteroidesaodiagnosticodeCOVID19,Com_vs_sem_CTC_previo,Perdadoenxertonos3mesesaposresolucaodainfeccao,Casotenhaocorridoperdadoenxertomarqueadatadaperda,Opacienteapresentasequelaspulmonares3mesesaposresolucao,Opacientefoiaobitonos3mesesaposaresolucaodainfeccao,DIVISOR_INTERNACAO,AnormalidadesvisualizadasemRaioXdetorax,Anormalidadesdetectadasnatomografia,HemogramaContagemdelinfocitostotaiseporcentagem,HemogramaHemoglobinaaadmissaogdL,HemogramaContagemPlaquetasaadmissaocelsÂµL,DosagemdeProteinaCreativaPCRaadmissao,DosagemdeTGOASTaadmissao,DosagemdeTGPALTaadmissao,Dosagemdebilirrubinaaadmissao,DosagemdeFosfataseAlcalinaFALCaadmissao,DosagemdeGamaGTGGTaadmissao,Dosagemdealbuminaaadmissao,DosagemdeRNIINRaadmissao,ValordeCreatininabasalmediadosultimos3valoresdecreati,ValordeSodiosericoaadmissao,ValordeTroponinaaadmissao,ValordeDdimeroaadmissao,Coinfeccao_Admissao,NiveldeimunosupressaongmLCyaFKEVRMMF,Presencadeasciteaadmissao,Presencadeencefalopatiaaadmissao,DIVISIOR___DOADOR,IdadedoDoador,SexodoDoador,DatadaMorteEncefalicadoDoador,Pesododoadorkg,Alturadodoadorcentimetros,TempodeUTIdodoadordias,DoadorfoiinternadoemquetipodeUTI,CausadaMorteEncefalicadoDoador,Usodedrogasvasoativaspelodoador,Sinaisdedoencainfecciosanodoador,Sinaisdeinfeccaorespiratorianodoador,Tomografiadetoraxdodoador,SaturacaoO2doador,DoadorcoletouSorologiaCOVID19,DoadorcoletouPCRSwabNasalparaCOVID19,QualdosexamescolhidosforneceuresultadopositivoparaCOVID,TGOASTdoador,TGPALTDoador,BilirrubinaDoadormgdL,FosfataseAlcalinadodoadorFALC,GamaglutamiltransferasedodoadorGGT,AlbuminadodoadorgdL,RNIINRdoador,DIVISOR___ALTA,Datadaaltahospitalarcasotenhaocorrido,PacienterealizoutestecomSwabnasalparacontroledecurae,CasopacientetenharealizadoSwabparacontroledecurainseri,NumerodeSwabsdecurarealizados,PacienterealizousorologiaELISAparacontroledecura,Creatininasericadaalta,Creatininaserica3mesesaposaalta,Pacienteapresentaascite3mesesaposainfeccao,Pacienteapresentaencefalopatia3mesesaposainfeccao,ValordeTGOAST3mesesaposresolucaodainfeccao,ValordeTGPALT3mesesaposresolucaodainfeccao,ValordeBilirrubina3mesesaposresolucaodainfeccao,ValordeFosfataseAlcalinaFALC3mesesaposresolucaodainf,ValordeGamaGTGGT3mesesaposresolucaodainfeccao
6/23/2021,Sim, ,Sim,Confirmado,A.D-2-ICDF,787675320,RIO BRANCO - AC,Centro-Oeste / DF,A.D,Feminino,9/16/1951,69,1,Branco,77,164,28.63,Colangite Esclerosante Primaria,7/7/2013,8,ICDF,Nao houve transplantes junto ou apos o figado,"Hipertensao, Diabetes Mellitus Tipo 1 ou Tipo 2","Inibidores da ECA (Captopril, enalapril, ramipril)",Sem informacao,0,1,0,0,0,1,0,0,0,0,0, ,0,0,0,0,0,0,0,0,0,0,0,0,0,0,0,0,0,0,0,0,0,0,0,0,0, , , ,0, , , , , , , , ,Hospitalar / Internacao, ,0, , ,0,1, , ,Sim - sem pronacao, ,Sim,FK + MMS + PRED,0,0,0,1,0,1,1,0, , , ,0,Sem informacao, , , , , , ,Nao realizou radiografia de torax / Nao informado,Nao realizou Tomografia de torax / Nao informado, , , , , , , , , , , , , , , ,Sem infromacoes, ,Nao informado,Nao informado, , , , , , , , , , , , ,Nao realizada, ,Nao,Nao, , , , , , , , , , , , , , , , , , , , , , , 
3/31/2021,Sim, ,Sim,Confirmado,HUWC/HSC- 17- LSC,159152-2320,"Fortaleza, CE",Nordeste,LSC,Feminino,8/15/1960,61,1,Pardo,88,156,36.16,Criptogenica,7/9/2016,5,Hospital Sao Carlos - HSC,Nao houve transplantes junto ou apos o figado,"Obesidade, Asma, DRC",Nao usava,Nao,0,0,0,0,1,0,0,0,1,1,0,Dispneia/ Dor toracica,0,0,0,0,0,0,0,0,0,0,0,0,0,0,0,0,0,0,0,0,0,0,0,1,1,"Dispneia, Dor toracica",3/16/2021,3/17/2021,1,1,0,3/17/2021,2,3/17/2021,3,2,PCR-Swab Nasal,Hospitalar / Internacao, ,0,2, ,0,2,3/19/2021,2,Sim - com pronacao,3/18/2021,Sim,TAC-MFS,0,0,0,0,0,1,1,0,Doses mantidas,0,Amoxicilina + Clavulanato,1,Sem informacao, ,Nao, , , , ,Nao realizou radiografia de torax / Nao informado,Nao realizou Tomografia de torax / Nao informado, , , , , , , , , , , , , , , ,Sim, ,Nao,Nao, ,38,Masculino,7/8/2016,75,160, ,UTI geral,TCE,Sim,Não,Nao,Nao realizada, ,Nao,Nao, ,356,244, ,33,25, , , , ,Nao, , ,Nao, , , , , , , , , 
12/10/2020,Sim, ,Sim,Confirmado,SCMBH-3-MAC,215257-3121,"Belo Horizonte, MG",Sudeste,MAC,Feminino,8/27/1950,70,1,Negro,81,158,32.45,"Hepatite / Cirrose Alcoolica, Carcinoma Hepatocelular  (CHC)",11/18/2018,2,Santa Casa de Belo Horizonte,Nao houve transplantes junto ou apos o figado,"Hipertensao, Diabetes Mellitus Tipo 1 ou Tipo 2, Obesidade, DRC",Nao usava,Nao,0,1,0,0,1,1,0,0,1,0,0,Febre/ Cefaleia/ Mialgia/ Diarreia/ Alteracao do olfato,0,0,0,0,0,0,0,0,0,0,0,0,1,1,1,0,0,0,0,1,0,0,1,0,0,"Febre, Cefaleia, Mialgia, Diarreia, Alteracao do olfato",12/5/2020,12/8/2020,3,3,0,12/8/2020,2,12/8/2020,285,282,PCR-Swab Nasal,Hospitalar / Internacao, ,0, , ,0,1, ,2,Nao, ,Nao,TAC-EVR,0,0,1,0,0,1,0,0,"Reducao de inibidores de Calcineurina (TAC, CsA)",1, ,0,Nao,0, , , , , ,Consolidacao focal / unilateral,Nao realizou Tomografia de torax / Nao informado,855-27, ,64000,66,30,17, ,95,45, , , ,134, , ,Sim, ,Nao,Nao, ,55,Feminino,11/17/2018, , , ,UTI geral, , , , ,Nao realizada, ,Nao,Nao, , , , , , , , , , ,Nao, , ,Nao, , , , , , , , , 
6/23/2021,Sim, ,Sim,Confirmado,CF-04-ICDF,2619545320,"BRASILIA, DF",Centro-Oeste / DF,CF,Feminino,12/21/1961,59,0,Negro, , , ,Auto-imune,11/20/2020,0,ICDF,Nao houve transplantes junto ou apos o figado, ,Sem dados,Sem informacao,0,0,0,0,0,0,0,0,0,0,0, ,0,0,0,0,0,0,0,0,0,0,0,0,0,0,0,0,0,0,0,0,0,0,0,0,0, ,11/27/2020,11/27/2020,0, , , , , ,4, , ,Hospitalar / Internacao,"    1,00",5,5,1,5,2,12/1/2020,4,Sim - sem pronacao,11/27/2020,Sim,PRED,0,0,0,1,0,0,0,0,Suspensao total,1,Cortico-esteroides em altas doses,1,Sem informacao, , , , ,Nao, ,Nao realizou radiografia de torax / Nao informado,Nao realizou Tomografia de torax / Nao informado, ,8,34, ,72,156,38,978,285, , , ,146, , ,Sem infromacoes, ,Nao informado,Nao informado, ,45,Feminino,11/26/2020,70, , , ,AVC (hemorragico ou isquemico), , , ,Nao realizada, ,Nao,Nao, , , , , , , , , , ,Nao, , , , , ,Nao,Nao, , , , , 
4/30/2021,Sim, ,Sim,Confirmado,HSC-31-MSP,173315-2320,"Fortaleza, CE",Nordeste,MSP,Feminino,11/10/1957,63,1,Pardo, , , ,Carcinoma Hepatocelular  (CHC),3/7/2019,2,Hospital Sao Carlos - HSC,Nao houve transplantes junto ou apos o figado,Diabetes Mellitus Tipo 1 ou Tipo 2,Sem dados,Nao,0,1,0,0,0,0,0,0,0,0,0,Tosse/ Espirros/ Cefaleia/ Congestao nasal/ Fadiga/ Alteracao do olfato,0,0,0,1,0,0,1,0,0,0,0,1,1,0,0,0,0,0,0,1,1,0,0,0,0,"Tosse, Dispneia, Espirros, Cefaleia, Congestao nasal, Fadiga, Alteracao do olfato",4/21/2021,4/26/2021,5,66, ,6/26/2021,2, ,148,82,Sorologia,Domiciliar, ,0, , ,0,1, ,4,Paciente nao foi internado, ,Paciente nao foi internado,TAC-MFS,0,0,0,0,0,1,1,0,Suspensao MMF,1, ,0,Nao,0, , , , , ,Nao realizou radiografia de torax / Nao informado,Nao realizou Tomografia de torax / Nao informado, , , , , , , , , , , , , , , ,Nao, ,Nao,Nao, ,20,Masculino,3/6/2019,70,165,3,UTI geral,TCE,Sim,Não,Nao,Nao realizada, ,Nao,Nao, ,98,238, ,240,35, , , , ,Nao, , ,Nao, , , , , , , , , 
5/25/2021,Sim, ,Sim,Confirmado,HC UNICAMP - 19 - EMJ,214437-6,"HORTOLANDIA, SP",Sudeste,EMJ,Feminino,8/28/1949,71,1,Branco,96,160,37.5,Carcinoma Hepatocelular  (CHC),4/13/2017,4,HC - UNICAMP,Nao houve transplantes junto ou apos o figado,"Hipertensao, Diabetes Mellitus Tipo 1 ou Tipo 2, Obesidade",Nao usava,Sem informacao,0,1,0,0,0,1,0,0,1,0,0,Febre/ Mialgia,0,0,0,0,0,0,0,0,0,0,0,0,0,1,1,0,0,0,0,0,0,0,0,0,0,"Febre, Mialgia",5/11/2021,5/18/2021,7,8,-1,5/19/2021,2,5/18/2021,128,120,PCR-Swab Nasal,Hospitalar / Internacao, ,0, ,0,0,1, ,7,Nao, ,Nao,CsA-MFS,0,1,0,0,0,0,1,0,Suspensao total,1, ,0,Sim,1, , , , , ,Nao realizou radiografia de torax / Nao informado,Opacidades em vidro fosco,1320 - 17, ,215000, ,23,29, ,86,105,4, , ,135, , ,Nao, ,Nao,Nao, ,50,Feminino,4/13/2017,80,165,3,UTI geral,AVC (hemorragico ou isquemico),Sim,Sim,Nao,Nao realizada,100,Nao,Nao, ,23,14, ,49,11, , , ,5/24/2021,Nao, , ,Nao, , , , , , , , , 
7/1/2021,Sim, ,Sim,Confirmado,SCSJC-MJNO,266383-6,"Sao Jose dos Campos, SP",Sudeste,MJNO,Feminino,5/20/1953,68,1,Pardo,55,152,23.81,Criptogenica,8/13/2020,1,Santa Casa de Sao Jose dos Campos,Nao houve transplantes junto ou apos o figado, ,Nao usava,Nao,0,0,0,0,0,0,0,0,0,0,0,Dispneia,0,0,0,0,0,0,0,0,0,0,0,0,0,0,0,0,0,0,0,0,0,0,0,1,0,"Febre, Dispneia",2/1/2021,2/2/2021,1,2,-1,2/3/2021,2,2/2/2021,15,13,PCR-Swab Nasal,Hospitalar / Internacao,"    1,00",14,14, ,0,2,2/16/2021,14,Sim - sem pronacao,2/2/2021,Nao,TAC-MFS,0,0,0,0,0,1,1,0,Suspensao MMF,1,Cortico-esteroides em altas doses,1,Sim,1, , , , , ,Nao realizou radiografia de torax / Nao informado,Opacidades em vidro fosco, , , , , , , , , , , , , , , ,Nao, ,Nao,Nao, ,52,Feminino,8/12/2020,68,160,10,UTI geral,AVC (hemorragico ou isquemico),Sim,Não,Nao,Nao realizada, ,Sim,Sim, ,29,43,216,176,804, , , , ,Nao, , ,Nao, , , , , , , , , 
4/23/2021,Sim, ,Sim,Confirmado,HSC-25-TKCS,182649-2320,"Fortaleza, CE",Nordeste,TKCS,Feminino,5/16/1995,26,0,Pardo,71,153,30.33,Auto-imune,7/9/2017,4,Hospital Sao Carlos - HSC,Nao houve transplantes junto ou apos o figado,"Obesidade, DRGE",Nao usava,Nao,0,0,0,0,0,0,0,0,1,0,0,Alteracao do olfato/ Alteracao do paladar,0,0,0,0,0,0,0,0,0,0,0,0,1,0,0,1,0,0,0,0,0,0,0,0,0,"Cefaleia, Alteracao do olfato, Alteracao do paladar",3/29/2021,4/8/2021,10,10, ,4/8/2021,2, ,171,161,PCR-Swab Nasal,Domiciliar, ,0, , ,0,1, ,15,Paciente nao foi internado, , ,TAC-MMF + PRED,0,0,0,1,0,1,0,1,Doses mantidas,0, ,0,Sim,1, , , , , ,Nao realizou radiografia de torax / Nao informado,Nao realizou Tomografia de torax / Nao informado, , , , , , , , , , , , , , , ,Nao, ,Nao,Nao, ,54,Feminino,7/9/2017,56,155,11,UTI geral,AVC (hemorragico ou isquemico),Sim,Sim,Sim,Nao realizada, ,Nao,Nao, ,93,86, ,592,201, , , , , , , , , , , , , , , , , 
12/29/2020,Sim, ,Sim,Confirmado,"HSC,3 EAPSL",267852-6,"Sao Jose dos Campos, SP",Sudeste,EAPSL,Feminino,6/6/1979,42,0,Branco,58,174,19.16,Perda de Enxerto,6/18/2020,1,Hospital Santa Casa de Sao Jose dos Campos,Nao houve transplantes junto ou apos o figado,Doenca auto-imune,Nao usava,Nao,0,0,0,1,0,0,0,0,0,0,0,Dispneia,0,0,0,0,0,0,0,0,0,0,0,0,0,0,0,0,0,0,0,0,0,0,0,1,0,Dispneia,7/4/2020,6/18/2020,-16,0,-16,7/4/2020,1,6/18/2020,1,1,PCR-Swab Nasal,Hospitalar / Internacao,"    1,00",17,2,2,2,2,7/5/2020,17,Sim - sem pronacao,7/4/2020,Sim,TAC-MFS,0,0,0,0,0,1,1,0,Suspensao MMF,1,Cortico-esteroides em altas doses,1,Sim,1, , , , , ,Radiografia normal,Opacidades em vidro fosco,26.1, , , ,32,26, ,102,111, , , , , , ,Nao, ,Sim,Nao, ,38,Feminino,6/17/2020,80,175,3,UTI geral,AVC (hemorragico ou isquemico),Sim,Não,Nao,Normal, ,Nao,Sim,PCR,27,21, ,77,54, , , , ,Nao, , ,Nao, , , , , , , , , 
8/2/2021,Sim, ,Sim,Confirmado,HLL-04-AADSB,132007-5,"Sao Paulo, SP",Sudeste,AADSB,Feminino,4/27/1956,65,1,Branco,65, , ,Hepatite C,1/17/2011,10,H Leforte,Nao houve transplantes junto ou apos o figado,"Hipertensao, Diabetes Mellitus Tipo 1 ou Tipo 2, IRC","Bloqueadores do receptor AT2 (Losartan, Valsartan)",Nao,0,1,0,0,1,1,0,0,0,0,0,Dispneia/ Fadiga,0,0,0,0,0,0,0,0,0,0,0,1,0,0,0,0,0,0,0,0,0,0,0,1,0,"Tosse, Dispneia, Dor toracica, Fadiga",2/15/2021,2/17/2021,2,3,-1,2/18/2021,2,2/17/2021,20,17,PCR-Swab Nasal,Hospitalar / Internacao,"    1,00",19,19,2,0,2,3/7/2021,18,Sim - com pronacao,2/18/2021,Sim,TAC-MFS,0,0,0,0,0,1,1,0,Suspensao MMF,1, ,0,Sim,1, , , , , ,Consolidacoes bilaterais,Nao realizou Tomografia de torax / Nao informado,20510, ,116, , , , , , , , , ,139,716, ,Sim, ,Nao,Nao, , , , , , , , , , , , ,Nao realizada, ,Nao,Nao, , , , , , , , , , ,Nao, , , , , , , , , , , , 
7/10/2021,Sim, ,Sim,Confirmado,HUCFF-10-NLNR,00,"Rio de Janeiro, RJ",Sudeste,NLNR,Feminino,3/6/1960,61,1,Pardo,51,155,21.23,Criptogenica,1/14/2021,0,HUCFF/UFRJ,Nao houve transplantes junto ou apos o figado,"Diabetes Mellitus Tipo 1 ou Tipo 2, Asma",Nao usava,Nao,0,1,0,0,0,0,0,0,0,1,0,Febre/ Tosse/ Expectoracao/ Fadiga/ Nauseas / vomitos/ Diarreia,1,0,0,1,0,0,0,1,0,0,0,1,0,1,0,0,0,0,0,0,0,0,1,0,0,Dispneia,5/19/2021,5/21/2021,2,3,6,5/22/2021,2,5/28/2021,23,20,Sorologia,Hospitalar / Internacao,"    1,00",12,10,10,14,2,6/11/2021,21,Sim - com pronacao,6/2/2021,Nao,TAC-MFS,0,0,0,0,0,1,1,0,Suspensao total,1,"Cortico-esteroides em altas doses, Heparina",1,Sim,1, , , , , ,Nao realizou radiografia de torax / Nao informado,Opacidades em vidro fosco,1145, , , ,28,30, ,323,334, , , ,136,0,6952,Nao,0,Nao,Nao, ,0, , , , , , , , , , ,Nao realizada, ,Nao,Sim, , , , , , , , , , ,Nao, , ,Nao,0,0, , , , , , , 
7/8/2021,Sim, ,Sim,Confirmado,HC UNICAMP - TSS,157918-6,"CAMPINAS, SP",Sudeste,TSS,Feminino,8/2/1946,75,1,Asiatico,50,155,20.81,Criptogenica,4/5/2013,8,HC - UNICAMP,Nao houve transplantes junto ou apos o figado,"Hipertensao, Diabetes Mellitus Tipo 1 ou Tipo 2, DRC",Sem dados,Sem informacao,0,1,0,0,1,1,0,0,0,0,0,Febre/ Tosse/ Mialgia,0,0,0,1,0,0,0,0,0,0,0,0,0,1,1,0,0,0,0,0,0,0,0,0,0,"Febre, Tosse, Mialgia",6/11/2021,6/16/2021,5,0, ,6/11/2021,2, ,97,97,PCR-Swab Nasal,Domiciliar, ,0, , ,0,1, ,22,Nao, ,Paciente nao foi internado,EVR,0,0,1,0,0,0,0,0,Doses mantidas,0, ,0,Nao,0, , , ,Nao, ,Nao realizou radiografia de torax / Nao informado,Nao realizou Tomografia de torax / Nao informado, , , , , , , , , , , , , , , , , , , , ,51,Masculino,4/4/2013,65,176,0,UTI geral,AVC (hemorragico ou isquemico),Nao,Não,Nao,Nao realizada,100,Nao,Nao, ,89,25, ,111,67, , , , ,Nao, , ,Nao, , , , , , , , , 
7/8/2021,Sim, ,Sim,Confirmado,HC UNICAMP - CMLM,01749-006,"SANTA BARBARA DO OESTE, SP",Sudeste,CMLM,Feminino,11/22/1974,46,0,Branco,58,159,22.94,Auto-imune,12/17/2012,8,HC - UNICAMP,Nao houve transplantes junto ou apos o figado, ,Nao usava,Sem informacao,0,0,0,0,0,0,0,0,0,0,0,Tosse/ Mialgia,0,0,0,1,0,0,0,0,0,0,0,0,0,0,1,0,0,0,0,0,0,0,0,0,0,"Tosse, Mialgia",6/1/2021,6/15/2021,14,0, ,6/1/2021,2, ,107,107,PCR-Swab Nasal,Domiciliar, ,0, , ,0,1, ,23,Paciente nao foi internado, ,Paciente nao foi internado,TAC-MFS,0,0,0,0,0,1,1,0,Suspensao MMF,1, ,0,Nao,0, , , ,Nao, ,Nao realizou radiografia de torax / Nao informado,Nao realizou Tomografia de torax / Nao informado, , , , , , , , , , , , , , , , , , , , ,29,Feminino,12/16/2002,65,170,2,UTI geral,TCE,Sim,Não, ,Nao realizada,100,Nao,Nao, ,70,35, ,113,17, , , , ,Nao, , , , , , , , , , , , 
6/29/2021,Sim, ,Sim,Confirmado,HUS-10-EAG,726626,"Sorocaba, SP",Sul,EAG,Feminino,10/11/1955,65,1,Branco, , , ,Hepatite C,6/26/2006,15,HUS - CETHUS, ,"Diabetes Mellitus Tipo 1 ou Tipo 2, Obesidade",Sem dados,Nao,0,1,0,0,0,0,0,0,1,0,0,Febre/ Tosse,0,0,0,1,0,0,0,0,0,0,0,0,0,1,0,0,0,0,0,0,0,0,0,0,0,"Febre, Dispneia",6/4/2021,6/5/2021,1,0,1,6/4/2021,2,6/5/2021,104,104,PCR-Swab Nasal,Hospitalar / Internacao,"    1,00",15,10, ,0,1, ,24,Sim - com pronacao,6/8/2021,Sim,TAC-MFS,0,0,0,0,0,1,1,0,Suspensao MMF,1,Cortico-esteroides em altas doses,1,Sim,1,Nao, ,Sem informacao,Nao, ,Nao realizou radiografia de torax / Nao informado,Opacidades em vidro fosco, ,12,54500, ,30,29, , , , , , , , , ,Sim, ,Nao,Nao, ,34,Masculino,6/25/2006,59,180,4,UTI geral,AVC (hemorragico ou isquemico),Sim, , ,Nao realizada,100,Nao,Nao, , , , , , , , , ,6/28/2021,Nao, , ,Nao, , ,Nao,Nao,16,14, ,50, 
7/1/2021,Sim, ,Sim,Confirmado,SCSJC-FFS,266450-6,"Sao Jose dos Campos, SP",Sudeste,FFS,Feminino,1/13/1982,39,0,Pardo,85,170,29.41,Doenca Policistica,9/29/2020,0,Santa Casa de Sao Jose dos Campos,Nao houve transplantes junto ou apos o figado, ,Nao usava,Nao,0,0,0,0,0,0,0,0,0,0,0,Tosse/ Dispneia/ Cefaleia,0,0,0,1,0,0,0,0,0,0,0,0,0,0,0,0,0,0,0,1,0,0,0,1,0,"Febre, Tosse, Coriza",6/20/2021,6/6/2021,-14,-14, ,6/6/2021,2, ,88,102,PCR-Swab Nasal,Domiciliar, ,0, , ,0,1, ,25,Nao, ,Nao,TAC-MFS,0,0,0,0,0,1,1,0,Suspensao MMF,1,"Cortico-esteroides em altas doses, Azatioprina",1,Sim,1,Nao, ,Nao,Nao, ,Nao realizou radiografia de torax / Nao informado,Tomografia normal, , , , , , , , , , , , , , , ,Nao, ,Nao,Nao, ,30,Masculino,9/27/2020,71,179,1,UTI geral,Hemorragia Extradural,Sim,Não,Nao,Normal, ,Sim,Sim,PCR,31,14,93,52,20, , , , ,Nao, , ,Nao, , ,Nao,Nao, , , , , 
2/18/2021,Sim, ,Sim,Confirmado,SC - 7 - CMG,1237,"Belo Horizonte, MG",Sudeste,CMG,Feminino,2/5/1964,57,0,Branco,73,154,30.78,Criptogenica,5/22/2020,1,Santa Casa de Belo Horizonte,Nao houve transplantes junto ou apos o figado,Hipertensao,Nao usava,Nao,0,0,0,0,0,1,0,0,0,0,0,Coriza/ Diarreia/ hiporexia,0,0,0,0,0,0,0,0,0,0,0,0,0,0,0,0,1,0,0,0,0,1,1,0,0,"Coriza, Diarreia, hiporexia",1/8/2021,1/21/2021,13,20, ,1/28/2021,2, ,251,231,Sorologia,Domiciliar, ,0, , ,0,1, ,28,Nao, ,Paciente nao foi internado,TAC,0,0,0,0,0,1,0,0,Doses mantidas,0, ,0,Nao,0, , ,Sem informacao,Nao, ,Nao realizou radiografia de torax / Nao informado,Nao realizou Tomografia de torax / Nao informado, , , , , , , , , , , , , , , , , ,Nao,Nao, ,60,Masculino, , , , , , , , ,Nao,Nao realizada, ,Nao,Nao, , , , , , , , , , ,Nao, , ,Nao, , ,Nao,Nao, , , , , 
7/7/2021,Sim, ,Sim,Confirmado,HM-11-VCF,70176-3220,"CARIACICA, ES",Sudeste,VCF,Feminino,3/1/1960,61,1,Branco,70,165,25.71,Hepatite C,2/28/2013,8,HOSPITAL MERIDIONAL,Nao houve transplantes junto ou apos o figado,Diabetes Mellitus Tipo 1 ou Tipo 2,Nao usava,Nao,0,1,0,0,0,0,0,0,0,0,0,Diarreia,0,0,0,0,0,0,0,0,0,0,0,0,0,0,0,0,0,0,0,0,0,0,1,0,0,Dispneia,3/20/2021,3/25/2021,5,13,-8,4/2/2021,2,3/25/2021,37,24,PCR-Swab Nasal,Hospitalar / Internacao,"    1,00",21,20,0,0,2,4/26/2021,32,Sim - sem pronacao,4/6/2021,Sim,TAC-MFS,0,0,0,0,0,1,1,0,Suspensao total,1, ,0,Nao,0, , , , , ,Radiografia normal,Opacidades em vidro fosco, , , , , , , , , , , , , , , ,Sim, ,Nao,Nao, ,25,Masculino,2/27/2013,70,170,3,UTI geral,TCE,Sim,Não, ,Nao realizada,99,Nao,Nao, ,294,190, ,77,22, , , , ,Nao, , , , , , , , , , , , 
5/30/2021,Sim, ,Sim,Confirmado,HMSJ-04-MZH,133015-4220,"Joinville, SC",Sul,MZH,Feminino,12/8/1954,66,1,Branco,75,177,23.94,Hepatite C,8/28/2015,5,Hospital Municipal Sao Jose/ Equipe Dr Christian,Nao houve transplantes junto ou apos o figado,Hipertensao,"Inibidores da ECA (Captopril, enalapril, ramipril)",Sim - previo,0,0,0,0,0,1,0,0,0,0,0,Febre/ Dispneia/ Dor toracica/ Coriza/ Mialgia,0,0,0,0,0,0,0,0,0,0,0,0,0,1,1,0,0,0,0,0,0,1,0,1,1,"Febre, Dispneia, Dor toracica, Mialgia",2/10/2021,2/11/2021,1,1,1,2/11/2021,2,2/12/2021,34,33,PCR-Swab Nasal,Hospitalar / Internacao,"    1,00",45,45,3,45,2,3/16/2021,33,Sim - com pronacao,2/14/2021,Sim,TAC-MFS,0,0,0,0,0,1,1,0,"Reducao de inibidores de Calcineurina (TAC, CsA)",1,"Cortico-esteroides em altas doses, Heparina",1,Sim,1, , , , , ,Consolidacoes bilaterais,Opacidades em vidro fosco, , ,90000, ,110,130, , , , , , , , , ,Sem infromacoes, ,Nao,Nao, ,34,Masculino,8/27/2015,70,175,1,UTI geral,TCE,Nao,Não,Nao,Nao realizada, ,Nao,Nao, ,49,34, ,5,24, ,1, , , , , , , , , , , , , , , 
4/30/2021,Sim, ,Sim,Confirmado,HUWC-32-KCSS,0,"Crateus, CE",Nordeste,KLSS,Feminino,7/24/1992,29,0,Pardo,60,155,24.97,Hepatite fulminante,1/22/2007,14,HUWC/UFC,Nao houve transplantes junto ou apos o figado, ,Nao usava,Nao,0,0,0,0,0,0,0,0,0,0,0,Dor de garganta,0,1,0,0,0,0,0,0,0,0,0,0,0,0,0,0,0,0,0,0,0,0,0,0,0,"Alteracao do olfato, Alteracao do paladar, Dor de garganta",3/24/2021,3/25/2021,1,1, ,3/25/2021,2, ,176,175,PCR-Swab Nasal,Domiciliar, ,0, ,1,5,1, ,36,Paciente nao foi internado, ,Paciente nao foi internado,TAC-MFS,0,0,0,0,0,1,1,0,Doses mantidas,0,Azitromicina,1,Sim,1, , , , , ,Nao realizou radiografia de torax / Nao informado,Nao realizou Tomografia de torax / Nao informado, , , , , , , , , , , , , , , ,Nao, ,Nao,Nao, , , , , , , , , , , , ,Nao realizada, ,Nao,Nao, , , , , , , , , ,4/7/2021,Nao, , ,Nao, , , , , , , , , 
6/1/2021,Sim, ,Sim,Confirmado,HQD-28-AMCSN,252876-3320,"Rio de Janeiro, RJ",Sudeste,AMCSN,Feminino,8/27/1962,58,0,Branco,90,163,33.87,"Carcinoma Hepatocelular  (CHC), NASH",8/20/2020,1,Hospital Quinta Dor / Equipe Lucio Pacheco,Nao houve transplantes junto ou apos o figado,"Hipertensao, Obesidade",Nao usava,Nao,0,0,0,0,0,1,0,0,1,0,0,Tosse/ Coriza/ Diarreia,0,0,0,1,0,0,0,0,0,0,0,0,0,0,0,0,0,0,0,0,0,1,1,0,0,Diarreia,4/15/2021,4/26/2021,11,0,11,4/15/2021,2,4/26/2021,154,154,PCR-Swab Nasal,Hospitalar / Internacao,"    1,00",1, ,11,10,1, ,36,Nao, ,Nao,TAC-EVR,0,0,1,0,0,1,0,0,Suspensao EVR,1,"Azitromicina, Ceftriaxone, Metronidazol",1,Nao,0, , , , , ,Nao realizou radiografia de torax / Nao informado,Opacidades em vidro fosco,"636 - 6,7", ,123000, ,49,26, ,73,68, , , ,136, ,950,Sim, ,Nao,Nao, ,18,Masculino,8/19/2020,80,175,5,UTI geral,TCE,Sim,Não,Nao,Nao realizada, ,Nao,Nao, ,495,256, ,42,20, , , ,5/3/2021,Nao, , ,Nao, , , , , , , , , 
5/24/2021,Sim, ,Sim,Confirmado,HC - 1 - ISSP,259454-6,"REGENTE FEIJO, SP",Sudeste,ISSP,Feminino,3/29/1954,67,1,Branco,50,161,19.29,Hepatite C,6/3/2020,1,HC - UNICAMP,Nao houve transplantes junto ou apos o figado,Diabetes Mellitus Tipo 1 ou Tipo 2,Nao usava,Sem informacao,0,1,0,0,0,0,0,0,0,0,0,ASSINTOMATICO,0,0,0,0,0,0,0,0,0,0,0,0,0,0,0,0,0,1,0,0,0,0,0,0,0,Dispneia,6/14/2020,5/28/2020,-17,-4,0,6/10/2020,1,6/10/2020,23,27,PCR-Swab Nasal,Hospitalar / Internacao,"    1,00",19,19,0,0,2,7/7/2020,40,Sim - sem pronacao,6/18/2020,Sim,AZA - TAC - MFS,1,0,0,0,0,1,1,0,"Suspensao AZA, MPA, mTORi",1,Heparina,1,Sim,1, , , , , ,Nao realizou radiografia de torax / Nao informado,"Opacidades em vidro fosco, Consolidacao focal / unilateral", , ,87000,129,12,18, ,136,104, , , ,140, , ,Nao, ,Sim,Nao, ,10,Feminino,6/2/2020,21,150,2,UTI geral,TCE,Nao,Não,Nao,Nao realizada,100,Sim,Nao,PCR,241,140, ,172,56, , , , ,Nao, , ,Nao, , , , , , , , , 