record_id,consent,gender_jantina,race,education,working_currently,if_working_currently,working_pre_covid,if_work_pre_covid,current_weight,height_cm,smoking_currently,current_health,health_pre_covid,diabetes_mellitus_kencing,hypertension_darah_tinggi,heart_disease_penyakit_jan,high_cholesterol_kolestero,cancer,stage_covid_19,care_received,hospital_stay,icu,ventilator,symptoms_severity,tiredness,feeling_sick,feeling_anxious,feeling_depressed,difficulty_thinking_or_con,headache,fever,difficulty_sleeping_insomn,cough,loss_of_smell_or_taste,loss_of_appetite,stomach_aches,diarrhoea,joint_or_muscle_pain,dizziness_on_standing,difficulty_breathing_or_sh,palpitations_or_increased,chest_pain,rashes,weight_loss,symptoms_get_worse,tx_symptom,work_affected,affect_work,Age_years,Duration_diagnosis_week,BMI,BMI_g,Comorbidities,Region,Edu_4g,age_grp_new,Long_COVID
691,1,2,1.0,4,1,0.0,1,1.0,70.0,153.0,0,1,1,0.0,0.0,0.0,0.0,0.0,6.0,1.0,,,,3.0,1.0,1.0,1.0,1.0,1.0,4.0,1.0,3.0,3.0,5.0,5.0,1.0,2.0,2.0,3.0,5.0,3.0,1.0,1.0,1.0,1.0,0.0,2.0,,,,29.04865649963689,2.0,0,3.0,4,,1.0
154,1,2,,4,0,,1,1.0,85.0,165.0,0,1,1,1.0,1.0,0.0,1.0,0.0,5.0,3.0,35.0,1.0,1.0,4.0,1.0,1.0,1.0,1.0,1.0,1.0,1.0,1.0,1.0,1.0,1.0,1.0,1.0,5.0,1.0,1.0,1.0,1.0,1.0,2.0,1.0,1.0,2.0,,,16.390300069445026,33.057851239669425,3.0,2,3.0,4,,1.0
277,1,1,,3,1,1.0,1,1.0,73.0,165.0,0,1,1,0.0,0.0,0.0,0.0,0.0,3.0,2.0,,,,3.0,1.0,1.0,1.0,1.0,1.0,1.0,1.0,1.0,1.0,4.0,1.0,1.0,1.0,1.0,1.0,1.0,1.0,1.0,1.0,1.0,1.0,0.0,2.0,,,38.10458581018385,26.813590449954088,2.0,0,3.0,3,,1.0
76,1,2,1.0,2,1,1.0,1,1.0,122.0,169.0,0,1,1,1.0,0.0,0.0,0.0,0.0,2.0,1.0,,,,2.0,1.0,1.0,1.0,1.0,1.0,1.0,1.0,4.0,1.0,1.0,1.0,1.0,1.0,2.0,1.0,1.0,1.0,1.0,3.0,1.0,1.0,0.0,,2.0,,,44.46623017401352,3.0,0,3.0,1,,1.0
28,1,2,1.0,4,1,1.0,1,1.0,58.0,160.0,0,1,1,0.0,0.0,0.0,0.0,0.0,1.0,1.0,,,,2.0,1.0,1.0,1.0,1.0,1.0,1.0,1.0,1.0,1.0,5.0,1.0,1.0,1.0,1.0,1.0,1.0,1.0,1.0,1.0,1.0,1.0,0.0,,2.0,31.035543052830388,,22.656249999999996,0.0,0,4.0,4,3.0,1.0
1_27,1,2,2.0,3,1,1.0,1,1.0,66.0,168.0,0,1,1,0.0,0.0,0.0,0.0,0.0,2.0,3.0,12.0,0.0,0.0,1.0,1.0,1.0,5.0,5.0,1.0,1.0,1.0,1.0,1.0,1.0,1.0,1.0,1.0,1.0,1.0,1.0,5.0,1.0,1.0,1.0,1.0,1.0,1.0,3.0,32.15806187555455,34.10458581018385,24.092970521541954,0.0,0,5.0,3,3.0,1.0
498,1,1,1.0,4,1,1.0,1,1.0,68.0,175.0,0,1,1,0.0,0.0,0.0,0.0,0.0,6.0,3.0,4.0,0.0,0.0,2.0,1.0,1.0,1.0,1.0,1.0,1.0,1.0,1.0,1.0,5.0,1.0,1.0,1.0,1.0,1.0,5.0,1.0,1.0,1.0,1.0,1.0,0.0,2.0,,32.880854483357425,52.24744295304099,23.510204081632654,0.0,0,3.0,4,3.0,1.0
325,1,2,1.0,4,1,1.0,1,1.0,62.0,156.0,0,1,1,0.0,0.0,0.0,0.0,0.0,2.0,1.0,,,,2.0,1.0,1.0,1.0,1.0,1.0,1.0,1.0,1.0,5.0,1.0,1.0,1.0,1.0,1.0,1.0,1.0,1.0,1.0,1.0,1.0,5.0,0.0,2.0,,33.4585409994423,39.390300095898134,25.476660092044707,2.0,0,3.0,4,3.0,1.0
7200,1,1,2.0,4,1,1.0,1,1.0,88.0,179.0,0,0,1,0.0,0.0,0.0,0.0,0.0,2.0,3.0,6.0,0.0,0.0,2.0,1.0,1.0,4.0,1.0,4.0,1.0,1.0,4.0,1.0,1.0,1.0,1.0,1.0,3.0,2.0,1.0,1.0,1.0,1.0,1.0,1.0,1.0,1.0,2.0,38.26620698164627,28.390300095898134,28.089010954714272,2.0,0,3.0,4,3.0,1.0
128,1,1,,3,1,1.0,1,1.0,82.0,166.0,1,1,1,0.0,0.0,0.0,0.0,0.0,2.0,1.0,,,,2.0,1.0,1.0,1.0,1.0,1.0,1.0,1.0,1.0,1.0,4.0,1.0,1.0,1.0,1.0,1.0,1.0,1.0,1.0,1.0,2.0,1.0,0.0,2.0,,38.644030390270494,37.818871524469564,31.572071418202935,3.0,0,3.0,3,3.0,1.0
140.0,1,1,2.0,3,1,1.0,1,1.0,84.7,177.0,0,0,1,0.0,1.0,0.0,0.0,0.0,3.0,2.0,,,,2.0,1.0,4.0,4.0,4.0,4.0,4.0,1.0,1.0,1.0,4.0,4.0,1.0,1.0,1.0,4.0,4.0,1.0,1.0,1.0,4.0,1.0,0.0,2.0,,38.79461218356276,26.390300095898134,28.088991030674453,2.0,1,3.0,3,3.0,1.0
595,1,2,1.0,3,1,1.0,1,1.0,63.0,156.0,0,1,1,0.0,0.0,0.0,0.0,0.0,1.0,1.0,,,,2.0,1.0,1.0,1.0,1.0,1.0,1.0,1.0,1.0,1.0,1.0,1.0,1.0,1.0,2.0,1.0,1.0,1.0,1.0,4.0,1.0,1.0,1.0,2.0,,42.394885968641475,38.390300095898134,25.88757396449704,2.0,0,1.0,3,4.0,1.0
477,1,2,3.0,4,0,,0,,63.0,165.0,0,1,1,0.0,0.0,0.0,0.0,0.0,2.0,1.0,,,,2.0,1.0,1.0,2.0,1.0,1.0,1.0,1.0,1.0,1.0,2.0,3.0,3.0,3.0,1.0,4.0,1.0,1.0,1.0,1.0,3.0,1.0,1.0,2.0,,43.5913267626182,24.961728667326707,24.609733700642796,0.0,0,3.0,4,4.0,1.0
602,2,2,1.0,3,0,,0,,116.0,160.0,0,1,1,0.0,1.0,0.0,0.0,0.0,1.0,2.0,,,,2.0,1.0,1.0,4.0,3.0,1.0,1.0,1.0,1.0,1.0,1.0,1.0,1.0,1.0,1.0,1.0,1.0,1.0,1.0,1.0,1.0,1.0,0.0,3.0,,57.3818811774026,38.390300095898134,45.31249999999999,3.0,1,1.0,3,5.0,1.0
159,1,2,,5,1,1.0,1,1.0,55.0,155.0,0,1,1,0.0,0.0,0.0,0.0,0.0,3.0,1.0,,,,3.0,1.0,1.0,1.0,1.0,3.0,1.0,1.0,1.0,3.0,2.0,1.0,4.0,1.0,2.0,1.0,1.0,1.0,2.0,1.0,1.0,1.0,0.0,1.0,2.0,58.93971827528076,39.24744295304099,22.476586888657646,0.0,0,3.0,5,5.0,1.0
19,1,2,1.0,4,1,1.0,1,1.0,58.0,157.0,0,0,1,0.0,0.0,0.0,0.0,0.0,3.0,3.0,2.0,0.0,1.0,4.0,2.0,2.0,5.0,2.0,5.0,5.0,1.0,1.0,1.0,1.0,2.0,1.0,1.0,5.0,1.0,5.0,1.0,5.0,1.0,4.0,2.0,1.0,,2.0,,,26.370238143535232,2.0,0,3.0,4,,1.0
14,1,2,1.0,3,1,1.0,1,1.0,78.0,165.0,0,1,0,1.0,1.0,0.0,0.0,0.0,1.0,2.0,,,,3.0,2.0,3.0,5.0,3.0,3.0,2.0,2.0,5.0,3.0,2.0,2.0,4.0,4.0,3.0,1.0,1.0,3.0,4.0,2.0,2.0,2.0,1.0,3.0,2.0,,2.3903000958981337,29.384756657483933,2.0,1,3.0,3,,1.0
1_37,1,2,2.0,3,1,1.0,1,1.0,61.0,159.0,0,1,0,0.0,0.0,0.0,0.0,0.0,2.0,1.0,,,,2.0,2.0,3.0,3.0,3.0,1.0,1.0,1.0,4.0,1.0,3.0,1.0,1.0,1.0,1.0,1.0,1.0,1.0,1.0,1.0,1.0,1.0,0.0,2.0,,,26.67601438161242,24.128792373719392,0.0,0,3.0,3,,1.0
16,1,1,,2,0,,0,,45.0,150.0,0,1,1,0.0,0.0,0.0,0.0,0.0,3.0,1.0,,,,2.0,2.0,2.0,2.0,2.0,2.0,2.0,2.0,2.0,2.0,2.0,4.0,4.0,4.0,4.0,4.0,4.0,4.0,4.0,4.0,4.0,4.0,0.0,3.0,,,18.81887152446956,17.77777777777778,1.0,0,1.0,1,,1.0
69,1,2,1.0,3,1,1.0,1,0.0,76.0,165.0,0,1,1,0.0,0.0,0.0,0.0,0.0,2.0,1.0,,,,3.0,2.0,2.0,1.0,1.0,3.0,2.0,2.0,1.0,2.0,4.0,2.0,2.0,2.0,2.0,2.0,2.0,2.0,2.0,2.0,2.0,2.0,0.0,,2.0,22.52904065721095,,30.48668503213958,3.0,0,3.0,3,2.0,1.0
431,1,2,2.0,4,1,1.0,1,1.0,48.0,147.0,0,1,1,0.0,0.0,0.0,0.0,0.0,6.0,1.0,,,,3.0,2.0,2.0,2.0,3.0,2.0,2.0,1.0,1.0,2.0,5.0,2.0,1.0,1.0,2.0,1.0,5.0,5.0,2.0,1.0,1.0,5.0,1.0,1.0,3.0,25.726850376581243,37.67601438161242,22.212966819380814,0.0,0,3.0,4,2.0,1.0
114.0,1,2,2.0,4,1,1.0,1,1.0,45.0,159.0,0,0,0,0.0,0.0,0.0,0.0,0.0,2.0,1.0,,,,3.0,2.0,3.0,2.0,1.0,2.0,2.0,1.0,3.0,4.0,1.0,1.0,1.0,1.0,1.0,1.0,1.0,1.0,1.0,1.0,1.0,1.0,0.0,2.0,,27.933558111009717,14.104585810183847,17.799928800284796,1.0,0,1.0,4,2.0,1.0
207,1,2,,4,1,1.0,1,1.0,63.0,161.0,0,0,1,0.0,0.0,0.0,0.0,0.0,2.0,1.0,,,,2.0,2.0,1.0,1.0,1.0,2.0,2.0,1.0,1.0,1.0,5.0,2.0,3.0,1.0,3.0,1.0,1.0,1.0,1.0,1.0,1.0,1.0,0.0,2.0,,28.738486242426553,41.53315723875528,20.832529609197174,0.0,0,4.0,4,2.0,1.0
185,1,2,,4,0,,1,1.0,47.0,155.0,0,1,1,0.0,0.0,0.0,0.0,0.0,2.0,3.0,9.0,0.0,0.0,3.0,2.0,1.0,1.0,1.0,1.0,1.0,1.0,1.0,1.0,4.0,1.0,1.0,1.0,1.0,1.0,1.0,1.0,1.0,1.0,1.0,1.0,0.0,2.0,,29.52972511990773,45.390300095898134,18.730489073881373,0.0,0,3.0,4,2.0,1.0
306,1,2,1.0,2,1,1.0,1,1.0,93.0,163.0,0,1,1,1.0,0.0,0.0,0.0,0.0,2.0,3.0,9.0,0.0,0.0,2.0,2.0,1.0,1.0,1.0,1.0,1.0,2.0,2.0,1.0,4.0,2.0,1.0,2.0,4.0,1.0,1.0,3.0,1.0,2.0,1.0,1.0,0.0,2.0,,35.70084079410349,35.53315723875528,35.00319921713275,3.0,0,3.0,1,3.0,1.0
196,1,2,,4,1,1.0,1,1.0,54.0,153.0,0,0,1,0.0,0.0,0.0,0.0,0.0,2.0,2.0,,,,3.0,2.0,2.0,5.0,5.0,1.0,1.0,1.0,1.0,1.0,2.0,1.0,5.0,1.0,1.0,1.0,2.0,1.0,5.0,2.0,5.0,1.0,1.0,1.0,2.0,35.8130926763759,49.9617286673267,24.77679524969029,0.0,0,3.0,4,3.0,1.0
118,1,2,,4,1,1.0,1,1.0,80.0,164.0,0,1,1,0.0,0.0,0.0,0.0,0.0,2.0,1.0,,,,3.0,2.0,3.0,4.0,3.0,3.0,3.0,2.0,3.0,3.0,2.0,2.0,1.0,2.0,1.0,1.0,1.0,2.0,1.0,1.0,1.0,1.0,1.0,1.0,3.0,36.31411937042108,23.81887152446956,29.744199881023206,2.0,0,3.0,4,3.0,1.0
401,1,2,2.0,4,1,1.0,1,1.0,50.0,160.0,0,0,1,0.0,0.0,0.0,0.0,0.0,1.0,1.0,,,,1.0,2.0,2.0,1.0,4.0,1.0,1.0,1.0,1.0,1.0,1.0,2.0,1.0,1.0,1.0,2.0,4.0,4.0,2.0,1.0,1.0,2.0,0.0,2.0,,38.99173744023627,36.53315723875528,19.531249999999996,0.0,0,3.0,4,3.0,1.0
138,1,2,,4,0,,0,,50.0,160.0,0,1,1,0.0,0.0,0.0,0.0,0.0,2.0,3.0,8.0,0.0,0.0,3.0,2.0,1.0,1.0,1.0,1.0,4.0,1.0,1.0,1.0,5.0,2.0,1.0,1.0,2.0,4.0,1.0,1.0,1.0,1.0,2.0,1.0,0.0,3.0,,39.33944449020205,46.9617286673267,20.703124999999996,0.0,0,3.0,4,3.0,1.0
1_58,1,1,2.0,2,1,1.0,1,1.0,82.0,170.0,0,0,0,0.0,0.0,0.0,0.0,0.0,1.0,2.0,,,,2.0,2.0,2.0,4.0,4.0,4.0,2.0,2.0,2.0,2.0,2.0,1.0,2.0,3.0,4.0,1.0,4.0,4.0,4.0,1.0,1.0,1.0,1.0,2.0,,41.088931143179465,24.24744295304099,29.065743944636683,2.0,0,3.0,1,4.0,1.0
1_21,1,2,2.0,3,0,,0,,72.0,160.0,0,1,1,0.0,0.0,0.0,0.0,0.0,4.0,2.0,,,,4.0,2.0,1.0,2.0,2.0,2.0,1.0,2.0,3.0,2.0,1.0,1.0,1.0,1.0,4.0,1.0,2.0,2.0,2.0,2.0,2.0,2.0,0.0,3.0,,45.26141574276878,25.533157238755276,30.273437499999993,3.0,0,3.0,3,4.0,1.0
310,1,1,1.0,5,1,1.0,0,,82.0,176.0,0,1,1,0.0,0.0,0.0,0.0,0.0,3.0,2.0,,,,3.0,2.0,2.0,2.0,4.0,3.0,1.0,3.0,1.0,2.0,1.0,1.0,2.0,3.0,3.0,2.0,2.0,2.0,3.0,1.0,2.0,2.0,1.0,1.0,3.0,45.51329801518494,20.10458581018385,27.44059917355372,2.0,0,5.0,5,4.0,1.0
1_49,1,1,2.0,5,1,0.0,1,0.0,111.0,178.0,0,0,1,0.0,1.0,0.0,0.0,0.0,4.0,3.0,5.0,0.0,1.0,2.0,2.0,1.0,4.0,4.0,2.0,1.0,1.0,4.0,1.0,1.0,1.0,1.0,2.0,1.0,2.0,1.0,2.0,1.0,2.0,1.0,2.0,0.0,1.0,2.0,48.40720629718357,24.961728667326707,33.77098851155157,3.0,1,3.0,5,4.0,1.0
25,1,2,,2,0,,0,,60.0,154.0,0,1,0,0.0,0.0,0.0,0.0,0.0,1.0,1.0,,,,2.0,2.0,1.0,1.0,1.0,1.0,2.0,1.0,2.0,1.0,1.0,1.0,1.0,1.0,1.0,4.0,1.0,4.0,1.0,1.0,1.0,1.0,0.0,2.0,,48.62897221094127,23.24744295304099,25.2993759487266,2.0,0,3.0,1,4.0,1.0
508,1,1,1.0,5,1,1.0,1,1.0,78.0,169.0,0,1,1,0.0,0.0,0.0,0.0,0.0,4.0,3.0,6.0,0.0,1.0,3.0,2.0,1.0,5.0,2.0,3.0,2.0,1.0,1.0,1.0,1.0,1.0,1.0,1.0,2.0,2.0,1.0,1.0,1.0,1.0,1.0,5.0,0.0,1.0,2.0,51.83499548267296,60.10458581018385,28.01022373166206,2.0,0,3.0,5,5.0,1.0
22,1,1,1.0,4,1,1.0,1,1.0,76.0,169.0,0,1,1,0.0,0.0,0.0,0.0,0.0,4.0,3.0,7.0,0.0,1.0,4.0,2.0,2.0,1.0,1.0,5.0,1.0,1.0,1.0,1.0,2.0,2.0,1.0,1.0,3.0,1.0,1.0,1.0,3.0,1.0,5.0,1.0,0.0,2.0,2.0,56.691942779045306,,28.360351528307834,2.0,0,3.0,4,5.0,1.0
92,1,2,,5,0,,1,0.0,62.0,162.0,0,0,1,0.0,1.0,0.0,1.0,0.0,2.0,3.0,2.0,0.0,0.0,3.0,2.0,1.0,1.0,1.0,3.0,1.0,1.0,1.0,1.0,1.0,1.0,1.0,1.0,5.0,1.0,1.0,1.0,1.0,1.0,1.0,1.0,1.0,1.0,2.0,59.618705270014225,43.390300069445026,22.86236854138088,0.0,2,3.0,5,5.0,1.0
450,1,2,1.0,4,1,1.0,1,1.0,90.0,153.0,0,1,1,1.0,1.0,0.0,0.0,0.0,2.0,1.0,,,,3.0,3.0,3.0,3.0,4.0,4.0,2.0,2.0,4.0,2.0,1.0,3.0,1.0,1.0,3.0,1.0,2.0,2.0,2.0,1.0,2.0,1.0,0.0,1.0,3.0,,28.390300095898134,38.446751249519416,3.0,1,3.0,4,,1.0
661,1,2,1.0,4,1,1.0,1,1.0,75.0,153.0,0,0,1,0.0,0.0,0.0,0.0,0.0,2.0,2.0,,,,2.0,3.0,3.0,3.0,5.0,5.0,2.0,5.0,5.0,1.0,2.0,1.0,2.0,1.0,5.0,3.0,3.0,1.0,1.0,1.0,1.0,5.0,1.0,1.0,3.0,,,30.757400999615534,3.0,0,3.0,4,,1.0
685,1,1,1.0,4,1,1.0,1,1.0,75.0,170.0,1,0,0,0.0,0.0,0.0,0.0,0.0,2.0,2.0,,,,2.0,3.0,3.0,5.0,1.0,1.0,5.0,2.0,2.0,1.0,1.0,1.0,2.0,1.0,4.0,1.0,1.0,1.0,2.0,1.0,1.0,2.0,0.0,1.0,2.0,,27.533157238755276,24.913494809688583,0.0,0,4.0,4,,1.0
299,1,2,1.0,4,1,1.0,1,1.0,55.0,152.0,0,1,1,0.0,0.0,0.0,0.0,0.0,2.0,2.0,,,,3.0,3.0,2.0,1.0,1.0,4.0,3.0,1.0,5.0,2.0,2.0,1.0,1.0,1.0,3.0,1.0,1.0,1.0,1.0,1.0,1.0,1.0,0.0,2.0,,29.765180287601094,38.10458581018385,23.372576177285318,0.0,0,4.0,4,2.0,1.0
533,1,2,1.0,4,1,1.0,1,1.0,81.0,152.0,0,0,1,0.0,0.0,0.0,0.0,0.0,3.0,3.0,6.0,0.0,0.0,3.0,3.0,3.0,3.0,4.0,4.0,4.0,1.0,4.0,4.0,1.0,1.0,1.0,1.0,4.0,1.0,3.0,2.0,2.0,1.0,2.0,1.0,0.0,1.0,3.0,31.717267898826282,24.961728667326707,35.924515235457065,3.0,0,3.0,4,3.0,1.0
554,1,2,1.0,3,1,1.0,1,1.0,67.0,155.0,0,1,1,0.0,1.0,0.0,0.0,0.0,2.0,2.0,,,,2.0,3.0,1.0,2.0,2.0,1.0,2.0,1.0,1.0,4.0,4.0,1.0,1.0,1.0,1.0,1.0,1.0,1.0,1.0,1.0,1.0,1.0,1.0,2.0,,35.39693935673183,38.53315723875528,28.720083246618103,2.0,1,2.0,3,3.0,1.0
375,1,2,6.0,4,0,,0,,90.0,150.0,0,0,1,0.0,0.0,0.0,0.0,0.0,2.0,2.0,,,,2.0,3.0,3.0,4.0,1.0,4.0,4.0,1.0,4.0,2.0,1.0,1.0,1.0,1.0,1.0,4.0,1.0,1.0,1.0,4.0,2.0,4.0,0.0,3.0,,35.5913267626182,25.67601438161242,41.77777777777778,3.0,0,5.0,4,3.0,1.0
102,1,2,2.0,2,1,0.0,1,1.0,43.0,152.0,0,0,1,0.0,0.0,0.0,0.0,0.0,2.0,2.0,,,,2.0,3.0,3.0,2.0,2.0,2.0,4.0,1.0,3.0,1.0,1.0,3.0,2.0,1.0,3.0,1.0,4.0,1.0,1.0,1.0,4.0,4.0,1.0,2.0,,35.93629596179685,,19.47714681440443,0.0,0,2.0,1,3.0,1.0
102.0,1,2,2.0,2,1,0.0,1,1.0,43.0,152.0,0,0,1,0.0,0.0,0.0,0.0,0.0,2.0,2.0,,,,2.0,3.0,3.0,2.0,2.0,2.0,4.0,1.0,3.0,1.0,1.0,3.0,2.0,1.0,3.0,1.0,4.0,1.0,1.0,1.0,4.0,4.0,1.0,2.0,,36.018431485410815,24.67601438161242,19.47714681440443,0.0,0,2.0,1,3.0,1.0
146.0,1,2,2.0,4,1,1.0,1,1.0,53.0,164.0,0,1,1,0.0,0.0,0.0,0.0,0.0,2.0,1.0,,,,2.0,3.0,1.0,3.0,4.0,3.0,1.0,1.0,1.0,1.0,2.0,2.0,1.0,1.0,1.0,1.0,1.0,1.0,1.0,1.0,2.0,2.0,0.0,2.0,,36.30864366884681,11.247442953040991,20.077334919690664,0.0,0,3.0,4,3.0,1.0
365,1,2,1.0,4,0,,0,,95.0,163.0,0,1,1,0.0,0.0,0.0,0.0,0.0,2.0,1.0,,,,3.0,3.0,3.0,4.0,3.0,4.0,2.0,2.0,2.0,3.0,3.0,2.0,2.0,1.0,3.0,3.0,3.0,3.0,1.0,2.0,1.0,3.0,0.0,3.0,,36.58790444913429,25.961728667326707,33.12130678610411,3.0,0,3.0,4,3.0,1.0
624,1,2,1.0,4,1,1.0,1,1.0,46.0,168.0,0,0,1,0.0,0.0,0.0,0.0,0.0,2.0,2.0,,,,3.0,3.0,3.0,3.0,3.0,3.0,3.0,2.0,2.0,5.0,5.0,2.0,3.0,1.0,3.0,3.0,3.0,3.0,3.0,2.0,3.0,3.0,1.0,1.0,,36.82609746761478,21.67601438161242,17.006802721088437,1.0,0,3.0,4,3.0,1.0
1_38,1,2,2.0,5,1,1.0,1,1.0,52.0,160.0,0,0,1,0.0,0.0,0.0,0.0,0.0,2.0,2.0,,,,2.0,3.0,3.0,3.0,3.0,4.0,1.0,2.0,1.0,2.0,2.0,2.0,1.0,1.0,2.0,1.0,2.0,2.0,2.0,1.0,2.0,1.0,0.0,1.0,2.0,38.381196714705816,25.961728667326707,20.312499999999996,0.0,0,3.0,5,3.0,1.0
12,1,1,1.0,3,1,1.0,1,1.0,104.0,171.0,0,0,1,0.0,1.0,0.0,1.0,0.0,5.0,3.0,17.0,1.0,1.0,4.0,3.0,2.0,3.0,2.0,4.0,3.0,1.0,1.0,1.0,1.0,1.0,1.0,1.0,4.0,2.0,2.0,2.0,4.0,1.0,2.0,3.0,0.0,3.0,2.0,39.52014264167747,,35.90848466194727,3.0,2,2.0,3,3.0,1.0
381,1,2,6.0,5,0,,1,0.0,140.0,165.0,0,0,0,0.0,1.0,0.0,1.0,0.0,2.0,3.0,13.0,0.0,0.0,2.0,3.0,3.0,3.0,5.0,5.0,1.0,2.0,5.0,1.0,1.0,1.0,1.0,2.0,5.0,1.0,1.0,4.0,1.0,1.0,1.0,1.0,1.0,1.0,2.0,40.47291471559944,80.39030009589813,48.11753902662994,3.0,2,3.0,5,4.0,1.0
9100,1,2,2.0,5,1,1.0,1,1.0,56.0,170.0,0,1,1,0.0,0.0,0.0,0.0,0.0,3.0,2.0,,,,3.0,3.0,3.0,3.0,3.0,4.0,3.0,3.0,4.0,3.0,3.0,1.0,1.0,2.0,2.0,4.0,2.0,3.0,3.0,1.0,2.0,2.0,0.0,2.0,,40.730272690065156,24.67601438161242,20.761245674740486,0.0,0,3.0,5,4.0,1.0
326,1,2,1.0,4,1,1.0,1,1.0,58.0,150.0,0,1,1,0.0,0.0,0.0,0.0,0.0,2.0,1.0,,,,3.0,3.0,4.0,3.0,2.0,4.0,4.0,1.0,1.0,1.0,1.0,1.0,3.0,1.0,2.0,1.0,2.0,3.0,1.0,1.0,1.0,4.0,0.0,1.0,3.0,41.35997837110554,40.53315723875528,25.77777777777778,2.0,0,3.0,4,4.0,1.0
491,1,1,3.0,5,1,1.0,1,1.0,88.0,180.0,0,0,1,0.0,0.0,0.0,0.0,0.0,1.0,2.0,,,,2.0,3.0,1.0,1.0,3.0,2.0,1.0,1.0,4.0,1.0,1.0,2.0,1.0,1.0,2.0,1.0,1.0,2.0,1.0,1.0,1.0,2.0,0.0,1.0,2.0,42.115625188354,45.818871524469564,26.234567901234566,2.0,0,3.0,5,4.0,1.0
9600,1,2,2.0,3,0,,0,,50.0,158.0,0,1,1,0.0,0.0,0.0,0.0,0.0,2.0,1.0,,,,2.0,3.0,3.0,5.0,5.0,5.0,5.0,1.0,5.0,1.0,5.0,1.0,5.0,1.0,5.0,5.0,1.0,1.0,1.0,1.0,1.0,1.0,0.0,3.0,,42.200498562755094,41.53315723875528,20.028841531805796,0.0,0,4.0,3,4.0,1.0
71,1,2,,4,1,1.0,1,1.0,70.0,158.0,0,0,1,0.0,1.0,0.0,1.0,0.0,2.0,3.0,6.0,0.0,0.0,3.0,3.0,3.0,3.0,3.0,3.0,2.0,1.0,3.0,2.0,3.0,1.0,1.0,2.0,2.0,5.0,1.0,5.0,5.0,5.0,1.0,5.0,1.0,2.0,,48.35792498253989,52.961728640873595,28.040378144528116,2.0,2,3.0,4,4.0,1.0
1_50,1,1,2.0,2,1,1.0,1,1.0,75.6,172.0,0,1,1,0.0,1.0,0.0,1.0,0.0,2.0,2.0,,,,3.0,3.0,2.0,4.0,4.0,2.0,1.0,1.0,4.0,3.0,1.0,2.0,1.0,1.0,1.0,1.0,1.0,4.0,1.0,1.0,3.0,2.0,0.0,2.0,,53.11357179978835,41.10458578373074,27.379664683612766,2.0,2,3.0,1,5.0,1.0
340,1,1,1.0,5,1,1.0,1,1.0,83.0,120.0,0,0,1,0.0,1.0,0.0,0.0,0.0,4.0,3.0,9.0,0.0,1.0,4.0,3.0,1.0,1.0,1.0,1.0,1.0,1.0,1.0,2.0,1.0,1.0,2.0,1.0,1.0,4.0,1.0,1.0,1.0,1.0,3.0,1.0,1.0,2.0,,55.98557727596523,31.961728667326707,60.41666666666667,3.0,1,1.0,5,5.0,1.0
1_39,1,2,2.0,1,1,1.0,1,1.0,70.0,160.0,0,1,1,0.0,1.0,0.0,0.0,0.0,4.0,3.0,10.0,1.0,0.0,4.0,3.0,2.0,3.0,3.0,3.0,2.0,1.0,5.0,1.0,2.0,2.0,1.0,1.0,2.0,2.0,2.0,2.0,2.0,1.0,1.0,2.0,0.0,1.0,2.0,62.356556057621624,41.390300095898134,27.343749999999996,2.0,1,3.0,1,5.0,1.0
649,1,2,1.0,2,1,1.0,1,1.0,92.0,157.0,0,0,1,1.0,1.0,0.0,0.0,0.0,2.0,2.0,,,,3.0,4.0,4.0,4.0,4.0,4.0,4.0,1.0,4.0,1.0,3.0,2.0,2.0,2.0,4.0,4.0,4.0,4.0,4.0,3.0,1.0,4.0,0.0,1.0,2.0,,,37.72972534382733,3.0,1,3.0,1,,1.0
73,1,1,,1,0,,1,1.0,74.0,172.0,0,0,1,1.0,1.0,0.0,0.0,0.0,3.0,2.0,,,,3.0,4.0,3.0,4.0,4.0,4.0,3.0,2.0,4.0,1.0,3.0,3.0,1.0,1.0,3.0,3.0,3.0,3.0,2.0,2.0,3.0,3.0,1.0,1.0,1.0,,31.67601438161242,29.745808545159548,2.0,1,3.0,1,,1.0
643,1,1,1.0,4,1,1.0,1,1.0,91.0,172.0,0,0,1,1.0,1.0,0.0,1.0,0.0,4.0,3.0,16.0,1.0,0.0,4.0,4.0,4.0,4.0,4.0,3.0,4.0,3.0,2.0,2.0,1.0,1.0,2.0,4.0,4.0,3.0,2.0,3.0,3.0,2.0,4.0,2.0,1.0,1.0,3.0,,,33.12601406165495,3.0,2,3.0,4,,1.0
398,1,2,1.0,4,1,1.0,1,1.0,70.0,155.0,0,0,1,0.0,1.0,0.0,1.0,0.0,2.0,3.0,6.0,0.0,0.0,3.0,4.0,5.0,5.0,5.0,5.0,5.0,1.0,5.0,1.0,1.0,1.0,1.0,1.0,2.0,2.0,2.0,2.0,5.0,5.0,5.0,5.0,1.0,1.0,2.0,,39.10458578373074,29.968782518210194,2.0,2,4.0,4,,1.0
59,1,2,1.0,2,1,1.0,1,1.0,65.0,165.0,0,1,1,0.0,0.0,0.0,1.0,0.0,2.0,1.0,,,,3.0,4.0,4.0,4.0,4.0,4.0,3.0,3.0,3.0,4.0,3.0,3.0,1.0,1.0,4.0,3.0,3.0,1.0,1.0,1.0,2.0,3.0,0.0,2.0,2.0,,,29.384756657483933,2.0,1,4.0,1,,1.0
640,1,1,2.0,4,1,1.0,1,1.0,66.0,180.0,0,0,1,0.0,0.0,0.0,1.0,0.0,2.0,1.0,,,,2.0,4.0,1.0,5.0,5.0,5.0,3.0,1.0,1.0,1.0,1.0,1.0,2.0,1.0,5.0,1.0,1.0,3.0,2.0,1.0,5.0,1.0,1.0,1.0,2.0,,,21.604938271604937,0.0,1,4.0,4,,1.0
58,1,1,1.0,3,1,1.0,1,1.0,75.0,176.0,0,1,1,1.0,0.0,0.0,1.0,0.0,1.0,3.0,30.0,1.0,1.0,4.0,4.0,4.0,4.0,4.0,3.0,4.0,4.0,4.0,4.0,4.0,4.0,4.0,4.0,5.0,4.0,4.0,4.0,5.0,4.0,4.0,4.0,1.0,,2.0,,,22.59814049586777,0.0,1,5.0,3,,1.0
679,1,2,1.0,4,1,1.0,1,1.0,86.0,154.0,0,1,1,0.0,0.0,0.0,0.0,0.0,2.0,1.0,,,,3.0,4.0,1.0,2.0,2.0,3.0,1.0,1.0,1.0,1.0,1.0,1.0,1.0,1.0,2.0,2.0,2.0,2.0,1.0,1.0,1.0,2.0,0.0,1.0,2.0,,,36.26243885984146,3.0,0,3.0,4,,1.0
638,1,2,1.0,4,1,1.0,1,1.0,58.0,162.0,0,1,1,0.0,0.0,0.0,0.0,0.0,2.0,3.0,14.0,0.0,0.0,3.0,4.0,1.0,1.0,1.0,2.0,4.0,1.0,1.0,1.0,2.0,2.0,3.0,4.0,3.0,4.0,3.0,5.0,4.0,2.0,2.0,2.0,0.0,1.0,3.0,,,22.10028959000152,0.0,0,3.0,4,,1.0
393,1,2,2.0,4,0,,0,,72.0,159.0,0,0,0,0.0,1.0,0.0,1.0,0.0,5.0,3.0,15.0,1.0,1.0,4.0,4.0,4.0,4.0,4.0,4.0,1.0,1.0,2.0,1.0,1.0,1.0,1.0,1.0,1.0,2.0,4.0,4.0,1.0,4.0,1.0,4.0,1.0,3.0,,,41.24744292658788,29.666548000474663,2.0,2,3.0,4,,1.0
366,1,2,1.0,4,1,1.0,1,1.0,45.0,155.0,0,0,1,0.0,0.0,0.0,0.0,0.0,2.0,2.0,,,,3.0,4.0,3.0,3.0,2.0,2.0,4.0,3.0,3.0,2.0,5.0,3.0,3.0,2.0,3.0,3.0,3.0,3.0,2.0,2.0,2.0,2.0,0.0,1.0,2.0,24.461963312926212,43.24744295304099,18.314255983350673,1.0,0,3.0,4,2.0,1.0
26,1,2,1.0,3,1,1.0,1,1.0,79.0,160.0,0,1,1,0.0,0.0,0.0,0.0,0.0,2.0,3.0,3.0,0.0,0.0,3.0,4.0,3.0,3.0,2.0,5.0,5.0,3.0,5.0,4.0,2.0,2.0,3.0,2.0,3.0,2.0,2.0,1.0,2.0,1.0,2.0,1.0,1.0,2.0,2.0,25.861005065150717,,34.37499999999999,3.0,0,3.0,3,2.0,1.0
136.0,1,2,2.0,3,1,1.0,1,1.0,52.5,156.0,0,1,1,0.0,0.0,0.0,0.0,0.0,1.0,1.0,,,,2.0,4.0,3.0,4.0,4.0,4.0,1.0,1.0,4.0,1.0,2.0,1.0,1.0,1.0,1.0,1.0,3.0,1.0,1.0,1.0,1.0,1.0,0.0,2.0,,26.13752799465106,20.390300095898134,20.956607495069033,0.0,0,3.0,3,2.0,1.0
540,1,2,1.0,5,0,,1,1.0,82.0,158.0,0,0,1,0.0,0.0,0.0,0.0,0.0,4.0,3.0,18.0,1.0,0.0,4.0,4.0,4.0,5.0,4.0,3.0,2.0,4.0,3.0,2.0,2.0,4.0,2.0,2.0,4.0,5.0,3.0,3.0,5.0,1.0,4.0,3.0,1.0,1.0,1.0,26.435953730448457,45.818871524469564,38.85595257170325,3.0,0,4.0,5,2.0,1.0
151.0,1,2,2.0,4,1,1.0,1,1.0,44.0,157.0,0,1,1,0.0,0.0,0.0,0.0,0.0,1.0,2.0,,,,1.0,4.0,3.0,3.0,2.0,4.0,1.0,2.0,4.0,1.0,1.0,2.0,1.0,1.0,2.0,2.0,1.0,1.0,1.0,1.0,3.0,1.0,0.0,1.0,3.0,27.92260670786119,13.818871524469563,18.662014686194166,0.0,0,4.0,4,2.0,1.0
478,1,2,1.0,5,1,1.0,1,1.0,70.0,162.0,0,1,1,0.0,0.0,0.0,0.0,0.0,2.0,2.0,,,,3.0,4.0,1.0,1.0,1.0,1.0,1.0,1.0,1.0,2.0,2.0,2.0,1.0,1.0,2.0,4.0,2.0,2.0,1.0,1.0,1.0,1.0,0.0,2.0,,28.19912963736153,43.10458581018385,24.76756591982929,0.0,0,3.0,5,2.0,1.0
618,1,2,2.0,4,1,1.0,1,1.0,58.0,161.0,0,0,1,0.0,0.0,0.0,0.0,0.0,2.0,1.0,,,,3.0,4.0,2.0,4.0,4.0,4.0,4.0,2.0,4.0,2.0,2.0,2.0,2.0,1.0,2.0,3.0,1.0,2.0,1.0,1.0,1.0,3.0,0.0,1.0,2.0,28.661826420386856,23.81887152446956,22.375679950619187,0.0,0,3.0,4,2.0,1.0
258,1,1,,5,1,1.0,1,1.0,90.4,180.0,0,0,1,1.0,1.0,0.0,0.0,1.0,3.0,3.0,6.0,0.0,0.0,3.0,4.0,4.0,4.0,4.0,4.0,4.0,1.0,4.0,4.0,2.0,3.0,1.0,3.0,3.0,4.0,2.0,4.0,4.0,1.0,3.0,4.0,1.0,1.0,2.0,29.598171389586035,39.390300095898134,29.166666666666664,2.0,2,3.0,5,2.0,1.0
15,1,2,1.0,4,1,1.0,1,1.0,75.0,158.0,0,0,1,0.0,0.0,0.0,0.0,0.0,2.0,2.0,,,,3.0,4.0,4.0,4.0,4.0,4.0,4.0,4.0,4.0,2.0,2.0,4.0,4.0,4.0,4.0,4.0,4.0,4.0,4.0,2.0,4.0,4.0,1.0,3.0,2.0,29.69947186870992,,32.446723281525394,3.0,0,3.0,4,2.0,1.0
333,1,2,1.0,3,1,1.0,1,1.0,98.0,160.0,0,0,1,0.0,0.0,0.0,0.0,0.0,5.0,3.0,33.0,1.0,1.0,4.0,4.0,5.0,2.0,2.0,3.0,4.0,2.0,2.0,4.0,1.0,1.0,1.0,1.0,2.0,2.0,2.0,3.0,4.0,1.0,3.0,3.0,0.0,1.0,2.0,29.98147049978453,40.53315723875528,42.18749999999999,3.0,0,3.0,3,2.0,1.0
141.0,1,2,2.0,4,1,1.0,1,1.0,67.0,168.0,0,0,1,0.0,0.0,0.0,0.0,0.0,2.0,1.0,,,,2.0,4.0,4.0,4.0,4.0,4.0,4.0,1.0,4.0,1.0,1.0,1.0,1.0,4.0,4.0,1.0,1.0,2.0,4.0,1.0,1.0,2.0,0.0,2.0,,30.107411635992605,24.961728667326707,23.738662131519277,0.0,0,3.0,4,3.0,1.0
3,1,2,,2,1,1.0,1,1.0,54.0,153.0,0,0,1,0.0,0.0,0.0,0.0,0.0,2.0,2.0,,,,2.0,4.0,2.0,4.0,4.0,2.0,1.0,1.0,2.0,1.0,1.0,2.0,1.0,1.0,4.0,1.0,1.0,1.0,1.0,1.0,2.0,1.0,1.0,2.0,,32.09235345666338,33.818871524469564,24.34960912469563,0.0,0,1.0,1,3.0,1.0
99,1,1,,3,1,1.0,1,1.0,69.0,172.0,0,1,1,0.0,0.0,0.0,0.0,0.0,2.0,1.0,,,,2.0,4.0,3.0,4.0,3.0,3.0,3.0,1.0,3.0,3.0,3.0,3.0,4.0,1.0,3.0,3.0,4.0,4.0,3.0,1.0,4.0,1.0,1.0,1.0,2.0,34.734379466245855,39.818871524469564,25.351541373715524,2.0,0,3.0,3,3.0,1.0
479,1,1,3.0,3,0,,1,0.0,82.0,172.0,0,0,0,0.0,0.0,0.0,0.0,0.0,2.0,1.0,,,,3.0,4.0,3.0,5.0,5.0,5.0,3.0,1.0,4.0,1.0,1.0,1.0,1.0,1.0,1.0,2.0,2.0,3.0,1.0,1.0,1.0,4.0,0.0,1.0,2.0,34.83020424379548,37.9617286673267,29.069767441860467,2.0,0,3.0,3,3.0,1.0
682,1,1,1.0,4,1,1.0,1,1.0,85.0,155.0,0,0,1,0.0,1.0,0.0,0.0,0.0,4.0,3.0,9.0,1.0,0.0,4.0,4.0,3.0,3.0,3.0,2.0,1.0,2.0,1.0,3.0,1.0,1.0,1.0,1.0,4.0,1.0,4.0,4.0,4.0,2.0,2.0,4.0,1.0,1.0,2.0,35.11767857644435,,37.04474505723204,3.0,1,3.0,4,3.0,1.0
199,1,2,,2,0,,0,,69.0,149.0,0,0,1,1.0,0.0,0.0,0.0,0.0,2.0,3.0,11.0,0.0,0.0,3.0,4.0,3.0,4.0,4.0,3.0,4.0,2.0,4.0,3.0,3.0,4.0,3.0,1.0,4.0,4.0,3.0,4.0,3.0,1.0,3.0,4.0,1.0,3.0,,35.59406461340534,40.818871524469564,37.83613350749966,3.0,0,1.0,1,3.0,1.0
113.0,1,2,2.0,4,1,1.0,1,1.0,70.3,173.0,0,1,1,0.0,0.0,0.0,0.0,0.0,1.0,1.0,,,,1.0,4.0,3.0,3.0,3.0,3.0,4.0,1.0,1.0,1.0,1.0,1.0,1.0,1.0,2.0,3.0,1.0,1.0,1.0,1.0,1.0,1.0,0.0,2.0,,36.62349650936701,21.81887152446956,23.48892378629423,0.0,0,3.0,4,3.0,1.0
523,1,2,1.0,4,1,1.0,1,1.0,104.0,157.0,0,0,1,0.0,1.0,0.0,0.0,0.0,3.0,3.0,12.0,0.0,0.0,3.0,4.0,4.0,4.0,4.0,4.0,4.0,1.0,2.0,1.0,1.0,1.0,2.0,2.0,4.0,4.0,4.0,4.0,4.0,3.0,1.0,4.0,0.0,1.0,2.0,37.82815085570513,27.390300095898134,39.75820520102235,3.0,1,3.0,4,3.0,1.0
87,1,2,,4,1,1.0,1,1.0,53.0,168.0,0,0,1,0.0,0.0,0.0,0.0,0.0,2.0,2.0,,,,3.0,4.0,4.0,4.0,4.0,4.0,4.0,3.0,4.0,2.0,3.0,3.0,3.0,1.0,3.0,3.0,4.0,3.0,4.0,4.0,4.0,4.0,0.0,1.0,3.0,37.93492703640328,38.10458581018385,21.612811791383223,0.0,0,3.0,4,3.0,1.0
529,1,2,1.0,3,1,1.0,1,1.0,74.0,155.0,0,1,1,0.0,0.0,0.0,0.0,0.0,4.0,3.0,3.0,0.0,0.0,4.0,4.0,3.0,3.0,2.0,1.0,1.0,1.0,1.0,1.0,1.0,1.0,1.0,1.0,3.0,2.0,1.0,1.0,1.0,1.0,1.0,1.0,0.0,2.0,,38.84663134851827,27.67601438161242,31.63371488033298,3.0,0,3.0,3,3.0,1.0
1_61,1,1,2.0,5,1,1.0,1,1.0,92.0,181.0,0,1,1,0.0,0.0,0.0,0.0,0.0,2.0,3.0,7.0,0.0,0.0,2.0,4.0,2.0,5.0,5.0,4.0,2.0,1.0,5.0,2.0,1.0,1.0,1.0,1.0,1.0,1.0,1.0,1.0,1.0,1.0,1.0,1.0,0.0,1.0,2.0,39.61322956891526,50.10458581018385,28.082170873904946,2.0,0,3.0,5,3.0,1.0
1_60,1,2,2.0,2,1,1.0,1,1.0,63.0,160.0,0,1,1,0.0,0.0,0.0,0.0,0.0,5.0,3.0,13.0,1.0,1.0,4.0,4.0,1.0,4.0,4.0,5.0,3.0,1.0,1.0,1.0,1.0,1.0,1.0,1.0,1.0,1.0,3.0,1.0,1.0,4.0,1.0,1.0,1.0,1.0,2.0,41.16285311443203,38.390300095898134,25.781249999999996,2.0,0,3.0,1,4.0,1.0
32,1,1,,5,1,1.0,1,1.0,85.0,171.0,0,0,1,0.0,0.0,0.0,0.0,0.0,1.0,2.0,,,,2.0,4.0,2.0,3.0,1.0,3.0,1.0,2.0,1.0,2.0,3.0,3.0,1.0,3.0,2.0,1.0,4.0,3.0,2.0,1.0,2.0,3.0,0.0,2.0,,41.26962929513018,20.533157238755276,30.436715570602924,3.0,0,4.0,5,4.0,1.0
122,1,1,,5,1,1.0,1,1.0,99.0,175.0,0,0,1,1.0,1.0,0.0,1.0,0.0,4.0,3.0,14.0,0.0,0.0,4.0,4.0,1.0,4.0,4.0,4.0,4.0,1.0,4.0,1.0,1.0,1.0,1.0,1.0,3.0,1.0,4.0,4.0,1.0,1.0,4.0,4.0,1.0,1.0,3.0,44.910970841540575,36.533157212302164,37.55102040816327,3.0,2,3.0,5,4.0,1.0
506,1,2,1.0,4,1,1.0,1,1.0,63.0,147.0,0,1,1,0.0,1.0,0.0,0.0,0.0,3.0,3.0,9.0,0.0,0.0,3.0,4.0,3.0,5.0,5.0,5.0,1.0,1.0,3.0,1.0,2.0,2.0,1.0,1.0,3.0,3.0,1.0,2.0,1.0,1.0,1.0,5.0,0.0,2.0,,45.05881478452101,51.67601438161242,30.542829376648623,3.0,1,3.0,4,4.0,1.0