Study_ID,ID,환자성명,생년월일,age10,Age,sex,입원일자.시간,퇴원일자,F/U duration,확진일,검사일,증상,증상발현일,발열,기침,가래,인후통,호흡곤란,호흡기 외 증상,근육통,두통,오한,미각소실,후각소실,기타,폐렴.유.무.,기저질환,DM,HTN,Stroke,Dementia,Malignancy,기타.1,RdRp.gene,E.gene,N.gene,흡연양.갑.일.년.,흡연여부,SBP,MBP,DBP,BT,HR,RR,BW,HT,BMI,Death,Discharge_Type,Death_Date,WBC,Hb,RDW,10plt,Plt,Ca,P,Glu,BUN,Cr,Bil,AST,ALT,Pro,Alb,Tchol,Na,K,Cl,Lactate,CRP,Procalcitonin,LDH,CPK,10bnp,BNP,tCO2,Stage,Final AKI,GFR,CKD,Pre/In-hospital,T/P/N/L,anemia,ICU
961.0,13287519,박회종,1967-04-18,5.4,54,1,2021-07-06,2021-07-13,7,2021-07-01,2021-06-30,0.0,,0.0,0.0,0.0,0.0,0.0,0.0,0,0.0,0.0,0.0,0.0,0.0,,1.0,0.0,1.0,,,,1,28.74,28.33,,비흡연,0.0,113,96.33333333333333,88.0,36.9,104.0,,103.5,177.0,33.03648376903188,0,0.0,,5.4,18.7,13.5,8.9,89,8.1,3.6,136,19,1.1,0.6,135,104,7.6,4.2,135.0,132,3.6,95,1.1,3.6,0.2,790,1479,1.41,14.1,28.2,1,1,106.98845311285369,0,1,1,0,0
500.0,13279265,이만재,1956-10-15,6.4,64,1,2021-04-20,2021-05-10,20,2021-04-20,2021-04-19,0.0,,0.0,0.0,0.0,0.0,0.0,0.0,0,0.0,0.0,0.0,0.0,0.0,0.0,0.0,0.0,0.0,,,,0,20.97,20.44,,한개비,2.0,137,111.0,98.0,37.2,77.0,20.0,65.9,164.0,24.50178465199286,0,0.0,,7.4,18.1,12.6,19.0,190,9.2,3.9,101,10,0.8,0.6,55,53,7.9,4.8,256.0,138,3.9,103,0.9,0.6,0.1,282,135,1.15,11.5,27.1,0,0,99.73082078348327,0,0,0,0,0
,13289977,,,5.3,53,1,2021-08-13,2021-08-18,5,,,,,,,,,,,,,,,,,,,0.0,1.0,,,,,,,,,,143,111.0,95.0,36.5,85.0,20.0,85.0,165.0,,0,,,5.9,17.9,12.0,15.4,154,8.2,2.3,190,15,1.0,1.0,64,39,7.1,3.9,120.0,139,3.4,101,1.4,16.9,0.23,923,465,2.883,28.83,27.2,0,0,,0,0,0,0,0
911.0,13287319,YANK1,1998-08-31,2.2,22,0,2021-07-02,2021-07-12,10,2021-07-01,2021-06-30,1.0,2021-06-27,1.0,1.0,1.0,1.0,0.0,1.0,0,1.0,1.0,0.0,0.0,0.0,0.0,0.0,0.0,0.0,,,,0,16.62,14.36,13.38,,2.0,151,111.66666666666667,92.0,36.7,103.0,20.0,68.0,173.0,22.72043837081092,0,0.0,,5.2,17.8,12.5,12.8,128,9.1,3.2,75,10,1.0,0.8,23,26,7.2,4.9,130.0,139,3.9,103,1.3,1.6,0.0,301,159,0.2,2.0,29.4,0,0,78.49212918035187,0,0,0,0,0
480.0,13279061,김태수,1966-12-31,5.4,54,1,2021-04-16,2021-04-21,5,2021-04-16,2021-04-15,1.0,2021-04-11,0.0,0.0,0.0,0.0,0.0,1.0,0,0.0,0.0,0.0,0.0,1.0,0.0,1.0,1.0,1.0,,,,아스피린.고지혈증,30.59,29.11,,1,2.0,137,92.33333333333333,70.0,37.2,103.0,20.0,103.0,178.0,32.50852165130665,0,0.0,,9.6,17.8,12.9,24.8,248,10.0,3.5,91,16,0.8,1.0,37,68,7.3,4.9,160.0,140,4.2,102,1.7,0.01,0.0,284,95,0.32,3.2,,0,0,101.27499213580465,0,0,0,0,0
159.0,13275529,이정복,1941-06-24,8.0,80,1,2021-01-20,2021-02-10,21,2021-01-20,2021-01-19,1.0,,0.0,1.0,0.0,0.0,0.0,0.0,0,0.0,0.0,0.0,0.0,0.0,,1.0,0.0,1.0,,,,0,18.41,19.64,19.34,0,1.0,182,116.0,83.0,36.4,88.0,20.0,68.0,165.0,24.97704315886134,0,0.0,,6.8,17.8,12.2,16.2,162,9.7,2.8,114,20,1.0,0.5,26,17,7.9,4.8,177.0,138,4.0,102,2.0,0.0,0.01,358,41,8.08,80.8,25.1,0,0,84.368956762815,0,0,0,0,0
972.0,13287530,김광춘,1963-12-07,5.7,57,0,2021-07-07,2021-07-20,13,2021-07-06,2021-07-05,1.0,2021-07-03,1.0,1.0,0.0,1.0,0.0,1.0,1,0.0,1.0,0.0,0.0,0.0,,1.0,0.0,0.0,,,1.0,1,10.36,,11.17,비흡연,0.0,120,93.33333333333333,80.0,36.7,96.0,20.0,67.0,167.0,24.02380867008498,0,0.0,,11.8,17.7,12.8,16.3,163,9.5,3.7,92,27,0.7,0.7,52,47,8.0,5.3,248.0,140,4.2,103,1.5,4.8,0.0,730,171,3.29,32.9,26.0,1,1,114.63333596461301,0,1,1,0,0
925.0,13287360,홍진만,1980-06-02,4.1,41,1,2021-07-02,2021-07-14,12,,,,,0.0,0.0,0.0,0.0,0.0,,0,0.0,0.0,0.0,0.0,0.0,,,0.0,0.0,,,,0,,,,비흡연,0.0,120,100.0,90.0,37.2,83.0,20.0,85.0,174.0,28.075042938300967,0,0.0,,5.6,17.5,12.8,17.5,175,8.6,3.4,93,10,0.8,0.9,52,62,7.4,4.6,82.0,142,4.2,101,2.4,1.8,0.0,624,128,0.2,2.0,26.6,0,0,,0,0,0,0,0
1082.0,13288483,서형민,1986-06-28,3.5,35,1,2021-07-17,2021-07-30,13,2021-07-09,2021-07-08,0.0,,0.0,0.0,0.0,0.0,0.0,0.0,0,0.0,0.0,0.0,0.0,0.0,0.0,0.0,0.0,0.0,,,,0,15.62,16.42,,비흡연,0.0,150,110.0,90.0,38.5,135.0,18.0,125.0,174.0,41.28682785044259,0,0.0,,5.7,17.4,12.6,15.5,155,8.4,2.1,226,13,0.8,1.2,141,152,7.4,4.6,173.0,125,3.2,89,2.0,6.8,0.3,1000,3906,0.2,2.0,25.9,1,1,140.3976406353773,0,1,1,0,0
977.0,13287534,박갑동,1971-02-09,5.0,50,1,2021-07-07,2021-07-22,15,2021-07-06,2021-07-05,1.0,2021-07-05,0.0,0.0,0.0,0.0,0.0,1.0,0,1.0,1.0,0.0,0.0,0.0,0.0,0.0,0.0,0.0,,,,0,7.78,,8.13,비흡연,3.0,150,112.66666666666667,94.0,37.5,99.0,20.0,53.5,168.0,18.95549886621315,0,0.0,,3.7,17.4,12.9,16.6,166,9.3,3.0,148,9,0.7,0.6,39,30,8.1,4.8,174.0,140,4.1,102,3.4,1.1,0.0,360,675,0.2,2.0,31.6,0,0,117.23439455192192,0,0,0,0,0
439.0,13278548,형장욱,1968-02-17,5.3,53,1,2021-04-02,2021-04-15,13,2021-04-02,2021-04-01,1.0,2021-03-30,0.0,0.0,0.0,0.0,0.0,1.0,1,0.0,0.0,0.0,0.0,1.0,0.0,1.0,1.0,1.0,,,,"고지혈증,공황장애",11.56,12.06,16.0,0,0.0,129,98.33333333333333,83.0,36.9,87.0,20.0,73.0,165.0,26.813590449954088,0,0.0,,4.9,17.4,13.4,19.4,194,8.8,3.5,169,16,1.0,0.7,31,18,7.6,4.8,139.0,143,4.3,107,1.4,0.3,0.0,261,87,1.6300000000000001,16.3,32.4,0,0,97.16934671543075,0,0,0,0,0
804.0,13285952,김광호,1965-09-23,5.5,55,1,2021-06-17,2021-06-29,12,2021-06-17,2021-06-16,1.0,2021-06-14,0.0,1.0,1.0,0.0,0.0,0.0,0,0.0,0.0,0.0,0.0,0.0,0.0,0.0,0.0,0.0,,,,0,17.27,17.81,21.65,30,2.0,118,95.33333333333333,84.0,36.7,85.0,20.0,65.0,173.0,21.71806608974573,0,0.0,,6.1,17.4,13.2,16.7,167,8.9,3.7,131,13,0.9,0.6,37,25,6.5,4.1,181.0,137,4.3,106,0.8,0.01,0.0,431,87,0.5599999999999999,5.6,26.2,0,0,95.81373715940376,0,0,0,0,0
312.0,13277071,박민재,1968-11-15,5.2,52,1,2021-02-25,2021-03-08,11,2021-02-25,2021-02-24,0.0,,0.0,0.0,0.0,0.0,0.0,0.0,0,0.0,0.0,0.0,0.0,0.0,0.0,1.0,1.0,1.0,,,,0,21.36,22.09,20.61,0,0.0,164,132.66666666666666,117.0,39.2,115.0,20.0,99.0,170.0,34.2560553633218,0,0.0,,10.2,17.3,12.8,18.8,188,8.8,3.1,139,19,1.1,0.6,50,42,7.6,4.4,99.0,139,4.3,101,1.4,5.6,0.3,523,538,0.52,5.2,25.6,0,0,102.70786962494223,0,0,0,0,0
,13289767,,,5.0,50,1,2021-08-10,2021-08-23,13,,,,,,,,,,,,,,,,,,,1.0,,,,,,,,,,,114,88.0,75.0,36.3,78.0,20.0,83.0,178.0,,0,,,5.2,17.3,12.5,14.4,144,9.5,3.9,147,20,1.2,0.67,70,67,7.4,5.1,68.0,138,4.4,105,1.4,0.6,0.04,356,139,1.001,10.01,26.4,1,1,,0,1,2,0,0
903.0,13287267,임준만,1988-06-20,3.3,33,1,2021-07-01,2021-07-23,22,2021-06-30,2021-06-29,1.0,2021-06-28,1.0,1.0,0.0,0.0,0.0,1.0,0,0.0,0.0,0.0,0.0,1.0,0.0,0.0,0.0,0.0,,,,0,12.93,15.94,13.69,비흡연,0.0,142,112.66666666666667,98.0,38.0,100.0,20.0,63.0,158.0,25.23634033007531,0,0.0,,7.9,17.2,12.6,24.7,247,9.8,5.1,97,14,0.9,0.5,59,46,7.9,5.1,189.0,137,4.4,99,2.4,0.5,0.0,477,352,0.2,2.0,28.5,0,0,123.99457659132345,0,0,0,0,0
316.0,13277132,신현주,1974-03-06,4.7,47,0,2021-02-28,2021-03-10,10,2021-02-27,2021-02-26,1.0,2021-02-23,0.0,0.0,0.0,0.0,0.0,1.0,0,1.0,1.0,0.0,0.0,0.0,0.0,1.0,0.0,0.0,,,1.0,갑상선암,25.75,25.15,25.33,0,0.0,154,117.33333333333333,99.0,37.0,87.0,20.0,58.0,160.0,22.65625,0,0.0,,3.8,17.2,12.1,15.6,156,8.9,3.7,105,12,0.5,0.5,30,20,7.5,5.0,185.0,145,3.7,104,1.4,1.6,0.01,432,28,0.86,8.6,30.2,0,0,132.3432636627022,0,0,0,0,0
438.0,13278534,하영철,1969-12-24,5.1,51,1,2021-04-02,2021-04-12,10,2021-04-02,2021-04-01,0.0,,0.0,0.0,0.0,0.0,0.0,0.0,0,0.0,0.0,0.0,0.0,0.0,0.0,0.0,0.0,0.0,,,,0,16.54,16.41,17.74,0,0.0,145,109.66666666666667,92.0,37.8,84.0,20.0,80.0,174.0,26.42356982428326,0,0.0,,7.5,17.2,12.3,15.1,151,9.2,3.5,122,18,0.9,0.4,30,25,7.3,4.7,199.0,139,4.4,103,1.9,0.01,0.01,355,97,0.2,2.0,28.8,0,0,98.54413595615506,0,0,0,0,0
960.0,13287522,김재구,1997-11-18,2.3,23,1,2021-07-06,2021-07-23,17,2021-07-04,2021-07-03,1.0,2021-07-01,0.0,0.0,0.0,1.0,0.0,1.0,0,1.0,0.0,0.0,0.0,0.0,0.0,0.0,0.0,0.0,,,,0,17.85,17.92,,비흡연,0.0,145,113.0,97.0,36.7,81.0,20.0,80.1,174.0,26.456599286563613,0,0.0,,5.8,17.0,12.7,13.3,133,9.0,3.2,108,11,0.7,0.5,33,20,7.9,5.0,111.0,138,3.8,106,1.2,0.9,0.01,526,114,0.2,2.0,24.7,0,0,141.7181046866901,0,0,0,0,0
968.0,13287521,정지호,1994-11-10,2.6,26,1,2021-07-06,2021-07-25,19,2021-07-05,2021-07-04,1.0,2021-07-02,1.0,0.0,0.0,0.0,0.0,1.0,1,0.0,1.0,0.0,0.0,0.0,0.0,0.0,0.0,0.0,,,,0,21.59,22.62,,비흡연,1.0,149,113.0,95.0,38.1,99.0,20.0,76.4,172.0,25.824770146024882,0,0.0,,3.1,17.0,12.1,10.8,108,9.2,3.3,77,16,1.1,0.4,28,22,7.4,4.9,149.0,139,3.9,103,1.5,0.7,0.0,373,101,0.27999999999999997,2.8,27.1,0,0,123.2886963127149,0,0,0,0,0
608.0,13280791,AZAMAT,1991-10-30,2.9,29,0,2021-05-08,2021-05-22,14,2021-05-07,2021-05-06,0.0,,0.0,0.0,0.0,0.0,0.0,0.0,0,0.0,0.0,0.0,0.0,0.0,0.0,0.0,0.0,0.0,,,,0,13.27,13.23,,0,2.0,164,120.0,98.0,36.8,82.0,20.0,82.0,179.0,25.592209980961897,0,0.0,,7.1,17.0,12.6,23.5,235,10.1,4.1,88,14,0.7,0.9,45,70,7.4,4.7,198.0,140,3.8,104,1.7,0.0,0.0,396,126,0.2,2.0,31.3,0,0,124.9268672529822,0,0,0,0,0
784.0,13285612,김기룡,1983-06-11,3.8,38,1,2021-06-11,2021-06-14,3,2021-06-05,2021-06-04,0.0,,0.0,0.0,0.0,0.0,0.0,0.0,0,0.0,0.0,0.0,0.0,0.0,0.0,0.0,0.0,0.0,,,,0,30.97,31,34.25,0,3.0,162,123.33333333333333,104.0,38.8,55.0,20.0,90.0,177.0,28.727377190462512,0,0.0,,7.5,17.0,12.7,28.9,289,9.6,4.1,87,10,0.8,0.7,29,28,6.7,4.5,225.0,143,4.4,104,1.8,0.01,0.01,348,128,1.29,12.9,,0,0,113.32200300150627,0,0,0,0,0
956.0,13287458,정남두,1968-04-16,5.3,53,1,2021-07-05,2021-07-17,12,2021-06-30,2021-06-29,1.0,2021-06-28,0.0,0.0,1.0,0.0,0.0,1.0,1,0.0,0.0,0.0,0.0,1.0,0.0,0.0,0.0,0.0,,,,0,12.68,10.06,9.99,비흡연,0.0,124,92.0,76.0,36.3,75.0,16.0,86.0,178.0,27.143037495265748,0,0.0,,8.2,17.0,12.2,15.0,150,8.5,3.3,137,17,0.7,0.9,56,59,7.1,4.2,168.0,139,4.1,102,1.7,2.3,0.1,686,89,2.04,20.4,28.2,0,0,114.78966551093336,0,0,0,0,0
477.0,13279045,박영환,1960-01-22,6.1,61,1,2021-04-15,2021-05-04,19,2021-04-15,2021-04-14,1.0,2021-04-13,0.0,0.0,0.0,0.0,0.0,1.0,0,1.0,0.0,0.0,0.0,0.0,0.0,1.0,0.0,1.0,,,,0,,28.45,,0,0.0,148,126.0,115.0,36.7,90.0,20.0,76.0,167.0,27.250887446663558,0,0.0,,4.9,17.0,13.0,14.1,141,8.8,3.6,79,10,1.0,0.9,49,71,6.8,4.5,71.0,140,4.4,105,1.0,0.2,0.0,368,222,0.5599999999999999,5.6,29.3,1,1,101.85483458529878,0,1,1,0,0
662.0,13282220,노게이,1961-02-28,6.0,60,0,2021-05-18,2021-05-31,13,2021-05-11,2021-05-10,0.0,,0.0,0.0,0.0,0.0,0.0,0.0,0,0.0,0.0,0.0,0.0,0.0,0.0,0.0,0.0,1.0,,,,0,32.54,32.45,,0,0.0,132,99.33333333333333,83.0,36.6,73.0,19.0,,,,0,0.0,,4.1,17.0,13.4,9.2,92,8.7,2.4,117,25,1.0,1.2,59,44,7.0,4.0,156.0,138,3.2,100,2.3,7.3,0.1,605,113,2.34,23.4,25.3,0,0,100.48067707116955,0,0,0,0,0
191.0,13275924,황재민,1983-09-24,3.7,37,1,2021-01-28,2021-02-11,14,2021-01-28,2021-01-27,1.0,2021-01-27,1.0,0.0,0.0,0.0,0.0,0.0,0,0.0,0.0,0.0,0.0,0.0,,0.0,0.0,0.0,,,,0,20.59,20.61,,0,0.0,108,86.66666666666667,76.0,37.9,114.0,20.0,67.0,167.0,24.02380867008498,0,0.0,,6.9,16.9,11.9,25.2,252,9.6,3.6,120,12,1.1,0.8,33,27,8.1,5.1,188.0,141,4.9,105,3.4,1.0,0.01,372,75,0.32,3.2,27.9,0,0,114.1208489441151,0,0,0,0,0
939.0,13287418,정소원,1983-02-01,3.8,38,0,2021-07-04,2021-07-23,19,2021-07-04,2021-07-03,1.0,2021-07-02,1.0,0.0,0.0,1.0,0.0,1.0,0,1.0,0.0,0.0,0.0,0.0,0.0,1.0,1.0,1.0,,,,0,9.92,11.11,,비흡연,0.0,112,94.0,85.0,37.1,80.0,20.0,56.0,151.0,24.560326301478007,0,0.0,,2.8,16.9,12.4,14.4,144,9.2,3.2,268,11,0.5,0.8,51,76,7.1,4.8,152.0,137,4.2,103,1.9,0.4,0.1,363,61,0.2,2.0,22.7,2,1,177.09140050271333,0,1,2,0,0
800.0,13285788,손호연,1969-11-11,5.1,51,1,2021-06-15,2021-06-26,11,2021-06-14,2021-06-13,0.0,,0.0,0.0,0.0,0.0,0.0,0.0,0,0.0,0.0,0.0,0.0,0.0,0.0,0.0,0.0,0.0,,,,0,15.29,13.48,16.53,60,2.0,130,106.0,94.0,36.5,66.0,18.0,68.0,174.0,22.460034350640772,0,0.0,,9.5,16.9,13.4,14.6,146,9.2,3.6,89,12,0.7,0.5,51,30,8.0,5.2,263.0,138,4.1,101,2.9,0.9,0.0,405,143,0.2,2.0,25.3,0,0,109.267036095139,0,0,0,0,0
518.0,13279386,이준환,1963-09-12,5.7,57,1,2021-04-22,2021-05-04,12,2021-04-21,2021-04-21,1.0,2021-04-17,0.0,0.0,0.0,1.0,0.0,1.0,1900-1-0,0.0,0.0,0.0,0.0,1.0,0.0,0.0,0.0,1.0,,,,0,18.3,18.9,,0,1.0,142,114.0,100.0,,87.0,15.0,71.0,173.0,23.72281065187611,0,0.0,,6.1,16.9,12.9,18.5,185,9.1,4.0,100,13,0.9,2.0,32,27,7.5,4.5,204.0,138,4.1,105,1.5,0.1,0.01,404,46,12.08,120.8,25.2,0,0,94.47703971229292,0,0,0,0,0
393.0,13278027,이상태,1954-01-01,6.7,67,1,2021-03-19,2021-03-31,12,2021-03-19,2021-03-18,1.0,2021-03-16,0.0,0.0,0.0,0.0,0.0,1.0,0,0.0,0.0,0.0,0.0,1.0,0.0,1.0,0.0,1.0,,,,고지혈증,21.14,21.59,,0,0.0,152,112.0,92.0,37.4,95.0,20.0,63.0,168.0,22.32142857142857,0,0.0,,7.7,16.9,13.2,15.2,152,10.4,3.6,89,18,1.3,0.5,37,22,7.8,4.7,187.0,141,4.7,102,0.8,0.8,0.01,410,73,3.2399999999999998,32.4,,0,0,56.45994396938892,1,0,0,0,0
462.0,13278847,장명호,1948-01-17,7.3,73,1,2021-04-12,2021-05-05,23,2021-04-12,2021-04-11,1.0,2021-04-05,0.0,0.0,1.0,0.0,0.0,1.0,1,0.0,0.0,0.0,0.0,0.0,0.0,0.0,0.0,0.0,,,,0,20.85,20.85,23.31,0,1.0,148,101.33333333333333,78.0,36.5,74.0,20.0,62.0,160.0,24.21875,0,0.0,,5.4,16.9,12.2,14.2,142,8.9,3.4,137,27,1.1,1.1,39,26,7.1,4.1,229.0,136,4.0,104,0.8,3.7,0.1,511,97,0.63,6.3,20.1,1,1,93.62086075852821,0,1,2,0,0
514.0,13279498,사히드,1987-01-18,3.4,34,0,2021-04-22,2021-05-07,15,2021-04-21,2021-04-21,0.0,,0.0,0.0,0.0,0.0,0.0,0.0,0,0.0,0.0,0.0,0.0,0.0,0.0,0.0,0.0,0.0,,,,0,19.34,19.16,18.98,0,0.0,134,105.33333333333333,91.0,37.7,100.0,20.0,75.0,173.0,25.05930702662969,0,0.0,,7.6,16.8,13.0,18.6,186,9.7,3.5,127,17,1.0,0.6,33,53,8.2,5.0,214.0,138,3.8,101,1.7,0.0,0.0,358,186,0.2,2.0,,0,0,72.14680311006835,0,0,0,0,0
931.0,13287357,진성호,1988-01-04,3.3,33,1,2021-07-03,2021-07-12,9,2021-07-02,2021-07-01,1.0,2021-06-30,0.0,0.0,0.0,0.0,0.0,1.0,1,0.0,0.0,0.0,0.0,0.0,0.0,0.0,0.0,0.0,,,,0,14.28,12.93,19.6,15,2.0,130,95.33333333333333,78.0,36.4,79.0,20.0,75.48,183.0,22.538744065215443,0,0.0,,4.8,16.7,12.3,17.4,174,9.5,3.6,89,14,0.9,0.6,148,103,7.3,5.0,195.0,139,4.9,107,0.8,0.01,0.0,773,12280,0.2,2.0,27.3,0,0,111.8263920218556,0,0,0,0,0
415.0,13278278,박승재,1962-02-15,5.9,59,1,2021-03-24,2021-04-07,14,2021-03-24,2021-03-23,1.0,2021-03-17,1.0,0.0,1.0,0.0,0.0,1.0,1,1.0,1.0,0.0,0.0,0.0,0.0,1.0,0.0,0.0,,,,0,17.27,18.39,18.61,0,0.0,189,146.33333333333334,125.0,37.2,126.0,20.0,61.7,172.0,20.855868036776634,0,0.0,,3.9,16.7,12.8,13.8,138,8.7,2.7,104,12,0.9,0.8,38,36,7.3,4.8,162.0,137,3.8,102,1.3,0.6,1.9,441,413,0.2,2.0,28.7,0,0,103.29591590813314,0,0,0,0,0
554.0,13279903,최정식,1956-08-01,6.5,65,1,2021-04-28,2021-05-29,31,2021-04-21,2021-04-20,1.0,2021-04-16,1.0,0.0,0.0,0.0,0.0,1.0,1,0.0,1.0,0.0,0.0,0.0,0.0,1.0,1.0,1.0,,,,0,7.47,9.06,,0,1.0,93,73.66666666666667,64.0,36.8,66.0,20.0,74.0,168.0,26.218820861678,1,2.0,21.5.29 01:26,8.0,16.7,12.0,14.3,143,8.4,2.8,116,25,0.9,0.6,48,33,6.4,4.0,151.0,134,4.0,100,1.3,4.5,0.01,827,52,4.55,45.5,27.4,1,1,113.72010825778979,0,1,3,0,1
983.0,13287529,이창남,1949-06-24,7.2,72,0,2021-07-07,2021-07-26,19,2021-07-06,2021-07-05,0.0,,0.0,0.0,0.0,0.0,0.0,0.0,0,0.0,0.0,0.0,0.0,0.0,0.0,0.0,1.0,0.0,,,,0,29.78,30,,비흡연,0.0,118,93.33333333333333,81.0,36.6,65.0,20.0,77.0,165.0,28.282828282828284,0,0.0,,6.1,16.7,12.9,16.9,169,9.0,4.4,128,12,0.8,1.0,35,20,7.5,4.4,110.0,139,4.8,106,1.6,0.1,0.0,382,59,1.73,17.3,27.0,0,0,72.35236647380123,0,0,0,0,0
547.0,13279812,송근엽,1952-06-13,6.9,69,1,2021-04-27,2021-05-11,14,2021-04-27,2021-04-26,0.0,,0.0,0.0,0.0,0.0,0.0,0.0,0,0.0,0.0,0.0,0.0,0.0,0.0,1.0,0.0,1.0,,,,"부정맥,피부낭종수술,갑상선제거",25.07,25.08,26.8,0,1.0,155,127.66666666666667,114.0,36.7,77.0,20.0,77.4,162.0,29.492455418381347,0,0.0,,5.1,16.6,13.3,12.3,123,9.3,4.0,82,16,1.1,0.5,24,22,6.9,4.4,193.0,144,4.7,106,0.9,0.4,0.01,343,110,9.45,94.5,26.6,0,0,91.14669917715914,0,0,0,0,0
1040.0,13288277,정다운,1994-06-28,2.7,27,1,2021-07-13,2021-07-14,1,2021-07-11,2021-07-10,1.0,2021-07-09,0.0,0.0,1.0,1.0,0.0,1.0,1,0.0,0.0,0.0,0.0,1.0,0.0,0.0,0.0,0.0,,,,0,,17.12,15.18,비흡연,0.0,127,42.333333333333336,,36.4,74.0,22.0,77.0,183.0,22.992624443847234,0,0.0,,4.7,16.5,12.4,14.1,141,9.3,3.9,89,13,0.9,0.5,21,15,7.0,4.7,216.0,140,4.4,105,0.9,0.8,0.0,258,61,1.7899999999999998,17.9,,0,0,116.64035211567052,0,0,0,0,0
1034.0,13288230,성동현,1997-02-09,2.4,24,1,2021-07-13,2021-07-27,14,2021-07-11,2021-07-10,1.0,2021-07-08,0.0,0.0,0.0,0.0,0.0,1.0,0,1.0,1.0,0.0,0.0,1.0,0.0,0.0,0.0,0.0,,,,0,21.64,19.99,18.72,2.4,2.0,120,95.33333333333333,83.0,36.6,95.0,20.0,81.0,182.0,24.453568409612366,0,0.0,,4.9,16.5,12.8,16.9,169,9.1,3.8,90,10,0.9,0.9,30,28,8.0,5.1,115.0,137,4.2,102,1.7,2.0,0.1,298,52,0.04,0.4,26.2,0,0,125.03303214415807,0,0,0,0,0
626.0,11775931,이정이,1974-10-26,4.6,46,1,2021-05-12,2021-05-18,6,2021-05-11,2021-05-11,1.0,2021-05-10,0.0,0.0,0.0,0.0,1.0,0.0,0,0.0,0.0,0.0,0.0,0.0,1.0,0.0,0.0,0.0,,,,0,25.35,24.86,,02월 03일,0.0,156,104.66666666666667,79.0,36.6,100.0,20.0,90.0,183.0,26.874496103198066,0,0.0,,14.3,16.5,14.9,18.0,180,8.5,2.1,139,10,1.0,3.3,151,178,6.9,4.1,182.0,138,4.6,105,0.6,15.4,0.0,400,66,1.1800000000000002,11.8,25.3,0,0,113.17302397940033,0,0,0,0,0
645.0,13281639,박흥규,1949-09-06,7.1,71,1,2021-05-16,2021-06-04,19,2021-05-16,2021-05-14,1.0,2021-05-14,0.0,0.0,0.0,0.0,0.0,0.0,0,0.0,0.0,0.0,0.0,0.0,0.0,1.0,1.0,1.0,,,,0,17.15,16.7,16.5,0,0.0,145,109.0,91.0,37.0,110.0,20.0,76.1,158.0,30.483896811408425,0,0.0,,7.6,16.5,12.9,15.0,150,9.4,5.6,284,15,1.0,0.8,49,73,7.8,4.5,147.0,144,3.9,106,2.3,1.0,0.1,406,66,3.09,30.9,27.5,2,1,109.02667195476472,0,1,1,0,0
219.0,13276343,박중권,1999-05-12,2.2,22,1,2021-02-03,2021-02-17,14,2021-02-03,2021-02-02,1.0,2021-02-02,0.0,0.0,0.0,0.0,0.0,0.0,0,0.0,0.0,0.0,0.0,0.0,,1.0,0.0,0.0,,,,하지연증,32.07,30.05,,0,0.0,114,91.33333333333333,80.0,36.9,82.0,20.0,59.0,176.5,18.939241948815898,0,0.0,,4.6,16.4,12.5,30.4,304,9.5,3.8,94,11,0.6,0.7,24,18,8.1,4.6,127.0,141,4.1,105,1.4,0.2,0.01,316,92,0.2,2.0,22.8,0,0,142.71712455860032,0,0,0,0,0
1030.0,13288215,마티아스,1997-07-10,2.4,24,0,2021-07-13,2021-07-22,9,2021-07-11,2021-07-10,0.0,,0.0,0.0,0.0,0.0,0.0,0.0,0,0.0,0.0,0.0,0.0,0.0,0.0,0.0,0.0,0.0,,,,0,33.86,33.5,34.57,비흡연,0.0,134,105.33333333333333,91.0,36.8,109.0,20.0,80.0,182.0,24.151672503320857,0,0.0,프랑스,12.6,16.4,13.9,26.0,260,9.9,3.3,77,12,1.1,0.8,24,23,7.6,4.9,128.0,139,4.5,101,2.0,6.8,0.1,332,72,0.43,4.3,29.5,0,0,68.9732754522095,0,0,0,0,0
919.0,13287362,이철우,1979-12-14,4.1,41,1,2021-07-02,2021-07-05,3,2021-07-03,,,,0.0,0.0,0.0,0.0,0.0,,0,0.0,0.0,0.0,0.0,0.0,,,0.0,0.0,,,,0,,,,비흡연,0.0,145,117.0,103.0,37.2,81.0,20.0,78.0,174.0,25.76298057867618,0,0.0,,7.8,16.4,12.9,31.5,315,9.2,3.1,92,12,0.8,1.3,20,28,8.0,4.7,219.0,139,4.2,99,1.1,0.01,0.01,410,80,0.08,0.8,,0,0,,0,0,0,0,0
501.0,13279267,이정국,1991-07-02,3.0,30,1,2021-04-20,2021-05-04,14,2021-04-20,2021-04-19,1.0,2021-04-15,0.0,1.0,0.0,0.0,0.0,0.0,0,0.0,0.0,0.0,0.0,0.0,0.0,0.0,0.0,0.0,,,,0,23.03,27.21,,0,0.0,129,87.66666666666667,67.0,37.5,97.0,20.0,65.3,167.0,23.414249345620135,0,0.0,,2.6,16.4,12.0,16.3,163,9.2,2.5,117,8,1.0,0.6,43,63,8.5,5.1,135.0,140,3.4,102,1.2,0.1,0.01,415,192,0.13999999999999999,1.4,29.5,0,0,119.87269083659965,0,0,0,0,0
855.0,13286980,문종석,1983-02-17,3.8,38,1,2021-06-25,2021-07-06,11,2021-06-25,2021-06-24,0.0,,0.0,0.0,0.0,0.0,0.0,0.0,0,0.0,0.0,0.0,0.0,0.0,0.0,1.0,1.0,0.0,,,,0,24.58,34.68,37.6,비흡연,0.0,135,113.0,102.0,36.5,82.0,20.0,90.0,165.0,33.05785123966942,0,0.0,,9.2,16.4,12.9,27.0,270,9.5,4.7,93,8,0.7,1.0,54,65,8.2,4.8,240.0,138,4.5,101,2.6,0.5,0.0,443,55,0.6599999999999999,6.6,23.4,0,0,127.54518349913725,0,0,0,0,0
917.0,13287364,윤성원,1978-06-19,4.3,43,1,2021-07-02,2021-07-13,11,2021-07-03,,,,0.0,0.0,0.0,0.0,0.0,,0,0.0,0.0,0.0,0.0,0.0,,,0.0,0.0,,,,0,,,,0.5,2.0,106,84.0,73.0,36.6,83.0,20.0,84.0,180.0,25.925925925925924,0,0.0,,6.5,16.4,12.4,57.0,570,8.5,3.2,87,12,0.6,1.8,69,123,6.6,3.7,233.0,137,4.6,98,1.4,2.1,0.01,621,86,0.03,0.3,26.9,0,0,,0,0,0,0,0
945.0,13287472,권형석,1975-09-23,4.5,45,1,2021-07-05,2021-07-19,14,2021-07-04,2021-07-03,1.0,2021-07-02,1.0,0.0,0.0,1.0,0.0,1.0,1,0.0,0.0,0.0,0.0,0.0,0.0,1.0,1.0,1.0,,,,0,19.35,18.52,18.57,비흡연,0.0,120,98.0,87.0,38.3,145.0,20.0,84.0,168.0,29.76190476190476,0,0.0,,8.0,16.4,12.6,17.7,177,8.7,3.0,209,17,1.1,0.8,32,43,7.5,4.6,140.0,133,3.9,99,1.6,3.0,0.1,412,68,0.25,2.5,21.0,0,0,107.88448224798607,0,0,0,0,0
306.0,13277016,장준호,1951-08-17,6.9,69,1,2021-02-24,2021-03-26,30,2021-02-24,2021-02-23,1.0,2021-02-22,0.0,1.0,0.0,0.0,0.0,0.0,0,0.0,0.0,0.0,0.0,0.0,0.0,1.0,0.0,0.0,,1.0,,치매,23.95,24.93,24.48,0,0.0,166,121.33333333333333,99.0,36.4,93.0,20.0,68.0,155.0,28.303850156087407,0,0.0,,3.8,16.4,13.3,17.6,176,8.6,3.1,94,12,0.7,0.6,26,22,7.2,4.5,212.0,139,4.5,104,1.7,0.2,0.1,450,66,0.5599999999999999,5.6,27.3,0,0,110.5692231874529,0,0,0,0,0
,13289940,,,5.8,58,0,2021-08-13,2021-08-25,12,,,,,,,,,,,,,,,,,,,0.0,1.0,,,,,17.31,15.67,16.8,,,132,96.0,78.0,37.9,96.0,20.0,70.0,168.0,,0,,,4.0,16.4,12.7,10.7,107,7.8,2.1,133,15,0.9,0.36,39,24,7.5,4.3,100.0,139,3.4,107,1.1,1.9,0.06,626,131,0.46799999999999997,4.68,23.8,1,1,,0,1,1,0,0
1042.0,13288550,정홍민,1996-06-23,2.5,25,1,2021-07-13,2021-07-16,3,2021-07-11,,1.0,2021-07-11,1.0,1.0,1.0,0.0,0.0,1.0,1,1.0,0.0,1.0,0.0,0.0,0.0,0.0,0.0,0.0,,,,0,21.28,18.93,20.06,10,2.0,120,98.66666666666667,88.0,36.2,82.0,20.0,103.2,178.0,32.571644994318895,0,0.0,,3.5,16.3,12.1,20.5,205,9.6,3.6,90,8,0.6,0.5,53,47,8.0,5.4,207.0,137,4.4,100,1.3,3.8,0.0,698,144,0.26,2.6,24.8,0,0,150.61468735812318,0,0,0,0,0
1089.0,13288550,정홍민,1996-06-23,2.5,25,1,2021-07-17,2021-07-30,13,2021-07-11,2021-07-13,1.0,2021-07-11,0.0,1.0,1.0,0.0,0.0,1.0,1,1.0,0.0,1.0,0.0,0.0,0.0,0.0,0.0,0.0,,,,0,21.28,18.93,20.06,10,2.0,120,98.66666666666667,88.0,36.2,82.0,20.0,103.2,178.0,32.571644994318895,0,0.0,,3.5,16.3,12.1,20.5,205,9.6,3.6,90,8,0.6,0.5,53,47,8.0,5.4,207.0,137,4.4,100,1.3,3.8,0.0,698,144,0.26,2.6,24.8,0,0,150.61468735812318,0,0,0,0,0
954.0,13287473,양재원,1979-09-28,4.1,41,1,2021-07-05,2021-07-15,10,2021-07-05,2021-07-04,1.0,2021-07-02,1.0,1.0,1.0,1.0,0.0,1.0,0,1.0,1.0,0.0,0.0,0.0,0.0,0.0,0.0,0.0,,,,0,8.22,10.82,12.04,10,2.0,129,93.66666666666667,76.0,37.1,78.0,20.0,87.0,183.0,25.978679566424795,0,0.0,,8.0,16.2,13.5,16.0,160,8.7,3.2,109,15,1.0,0.5,20,17,7.3,4.6,154.0,140,3.7,106,1.3,7.5,0.1,330,78,0.74,7.4,28.2,0,0,110.95886040346882,0,0,0,0,0
1021.0,13287995,지상우,1978-06-26,4.3,43,1,2021-07-11,2021-07-28,17,2021-07-11,2021-07-10,1.0,2021-07-09,1.0,0.0,0.0,0.0,0.0,0.0,0,0.0,0.0,0.0,0.0,0.0,0.0,0.0,0.0,0.0,,,,0,21.07,21.47,25.68,비흡연,1.0,132,108.66666666666667,97.0,38.1,74.0,20.0,81.9,174.0,27.05112960760999,0,0.0,,2.8,16.2,12.6,12.5,125,8.9,4.1,125,14,1.0,1.6,34,43,7.8,4.9,122.0,138,3.9,103,1.1,0.7,0.1,338,255,0.2,2.0,26.2,0,0,109.41087334198002,0,0,0,0,0
883.0,13287163,김철민,1963-02-14,5.8,58,1,2021-06-29,2021-07-12,13,,,1.0,2021-06-26,0.0,0.0,0.0,0.0,0.0,0.0,0,0.0,0.0,0.0,0.0,0.0,,,0.0,0.0,,,,0,,,,비흡연,3.0,114,88.0,75.0,37.7,66.0,30.0,67.0,170.0,23.183391003460205,0,0.0,,4.8,16.2,12.0,7.5,75,8.5,3.4,84,17,0.8,0.8,71,35,7.6,4.3,162.0,135,4.6,97,1.1,10.7,0.1,828,110,0.06999999999999999,0.7,29.9,2,1,,0,1,3,0,0
828.0,13286523,엄영천,1970-08-10,5.0,50,1,2021-06-21,2021-07-07,16,2021-06-21,,,,0.0,0.0,0.0,0.0,0.0,,0,0.0,0.0,0.0,0.0,0.0,,,0.0,0.0,,,,0,,,,,3.0,149,115.0,98.0,39.4,91.0,24.0,87.0,168.0,30.824829931972793,0,0.0,,7.2,16.2,13.1,21.3,213,9.1,3.2,91,14,0.9,0.8,101,91,7.9,4.6,181.0,135,4.5,95,1.9,13.5,0.1,821,165,0.41,4.1,25.6,0,0,,0,0,0,0,0
,13289854,,,4.5,45,1,2021-08-12,2021-08-21,9,,,,,,,,,,,,,,,,,,,0.0,0.0,,,,,13.27,14.31,,,,114,94.0,84.0,36.7,89.0,20.0,71.0,173.0,,0,,,3.2,16.2,11.8,14.1,141,8.6,3.5,103,10,0.7,0.41,106,110,7.1,4.4,116.0,137,3.6,100,0.9,3.2,0.07,740,120,0.339,3.39,29.3,0,0,,0,0,0,0,0
612.0,13280722,선정남,2002-05-03,1.9,19,0,2021-05-08,2021-05-20,12,2021-05-08,2021-05-07,1.0,2021-05-08,1.0,0.0,0.0,1.0,0.0,0.0,0,0.0,0.0,0.0,0.0,0.0,0.0,0.0,0.0,0.0,,,,0,21.2,,21.49,0,0.0,156,108.0,84.0,37.2,121.0,20.0,62.3,174.0,20.577355000660585,0,0.0,,5.0,16.1,12.2,19.8,198,9.1,4.8,72,10,1.1,0.4,28,31,7.3,4.7,132.0,140,3.8,103,1.6,0.5,0.0,305,74,0.2,2.0,32.3,0,0,104.98870289498323,0,0,0,0,0
395.0,13278060,송,1993-07-05,2.8,28,0,2021-03-19,2021-04-03,15,2021-03-19,2021-03-17,1.0,2021-03-19,1.0,0.0,0.0,0.0,0.0,1.0,1,0.0,0.0,0.0,0.0,0.0,0.0,0.0,0.0,0.0,,,,0,28.2,28.4,,0,0.0,115,91.66666666666667,80.0,36.5,103.0,20.0,65.0,173.0,21.71806608974573,0,0.0,,9.4,16.1,12.1,17.1,171,9.7,3.2,116,17,1.0,1.3,22,18,8.9,5.2,214.0,142,3.9,103,1.7,0.6,0.0,344,91,0.27,2.7,29.0,0,0,85.47564899928179,0,0,0,0,0
425.0,13278348,김재형,1991-01-21,3.0,30,1,2021-03-27,2021-04-08,12,2021-03-25,2021-03-24,1.0,2021-03-24,0.0,0.0,0.0,0.0,0.0,1.0,0,1.0,0.0,0.0,0.0,0.0,0.0,1.0,0.0,0.0,,,,골절진통제,18.2,19.3,19.24,0,0.0,128,107.33333333333333,97.0,36.4,83.0,20.0,97.0,166.0,35.20104514443316,0,0.0,,4.7,16.1,12.7,14.7,147,8.5,2.6,333,6,0.8,0.5,129,173,7.6,4.1,170.0,136,3.9,100,1.2,1.0,0.1,404,257,0.2,2.0,27.3,0,0,134.91805602029666,0,0,0,0,0