id,gender,age,ALT,LDH,platelets,diabetes,COPD,cancer,heart,liver,death
1.0,1.0,75.0,25.0,533.0,,0.0,0.0,0.0,0.0,0.0,1.0
2.0,1.0,58.0,14.0,173.0,232.0,0.0,0.0,0.0,0.0,0.0,0.0
3.0,1.0,78.0,47.0,380.0,207.0,0.0,0.0,1.0,0.0,0.0,1.0
4.0,1.0,29.0,42.0,193.0,246.0,0.0,0.0,0.0,0.0,0.0,0.0
5.0,2.0,57.0,12.0,167.0,242.0,0.0,0.0,0.0,0.0,0.0,0.0
6.0,1.0,34.0,19.0,221.0,124.0,0.0,0.0,0.0,0.0,0.0,0.0
7.0,2.0,26.0,39.0,368.0,141.0,0.0,0.0,0.0,0.0,0.0,0.0
8.0,2.0,66.0,22.0,303.0,56.0,0.0,0.0,0.0,0.0,0.0,0.0
9.0,2.0,44.0,11.0,197.0,130.0,0.0,0.0,0.0,0.0,0.0,0.0
10.0,1.0,65.0,,295.0,111.0,0.0,0.0,0.0,0.0,0.0,0.0
11.0,1.0,27.0,27.0,246.0,182.0,0.0,0.0,0.0,0.0,0.0,0.0
12.0,1.0,44.0,19.0,202.0,130.0,0.0,0.0,0.0,0.0,0.0,0.0
13.0,1.0,41.0,25.0,365.0,234.0,0.0,0.0,0.0,0.0,0.0,0.0
14.0,2.0,42.0,28.0,237.0,147.0,0.0,0.0,0.0,0.0,0.0,0.0
15.0,1.0,31.0,37.0,183.0,189.0,0.0,0.0,0.0,0.0,0.0,0.0
16.0,1.0,23.0,,365.0,,0.0,0.0,0.0,0.0,0.0,0.0
17.0,1.0,79.0,,380.0,264.0,0.0,0.0,0.0,0.0,0.0,1.0
18.0,2.0,44.0,22.0,365.0,121.0,0.0,0.0,0.0,0.0,0.0,0.0
19.0,1.0,64.0,20.0,273.0,74.0,0.0,0.0,0.0,0.0,0.0,0.0
20.0,2.0,44.0,,365.0,92.0,0.0,0.0,0.0,0.0,0.0,0.0
21.0,1.0,67.0,9.0,160.0,310.0,0.0,0.0,0.0,0.0,0.0,0.0
22.0,2.0,35.0,35.0,155.0,312.0,0.0,0.0,0.0,0.0,0.0,0.0
23.0,1.0,46.0,21.0,281.0,78.0,0.0,0.0,0.0,0.0,0.0,0.0
24.0,1.0,7.0,57.0,365.0,,0.0,0.0,0.0,0.0,0.0,0.0
25.0,1.0,11.0,30.0,297.0,172.0,0.0,0.0,0.0,0.0,0.0,0.0
26.0,1.0,35.0,15.0,165.0,191.0,0.0,0.0,0.0,0.0,0.0,0.0
27.0,2.0,82.0,17.0,180.0,270.0,1.0,0.0,0.0,0.0,0.0,0.0
28.0,1.0,72.0,97.0,224.0,540.0,1.0,0.0,0.0,0.0,0.0,0.0
29.0,1.0,73.0,42.0,299.0,,0.0,0.0,0.0,0.0,0.0,1.0
30.0,1.0,45.0,28.0,237.0,214.0,0.0,0.0,0.0,0.0,0.0,0.0
31.0,2.0,32.0,,194.0,318.0,0.0,0.0,0.0,0.0,0.0,0.0
32.0,2.0,83.0,40.0,365.0,149.0,0.0,0.0,0.0,0.0,0.0,0.0
33.0,1.0,63.0,13.0,222.0,290.0,0.0,1.0,0.0,0.0,0.0,0.0
34.0,2.0,47.0,144.0,398.0,429.0,0.0,0.0,0.0,0.0,0.0,0.0
35.0,1.0,64.0,25.0,222.0,175.0,0.0,0.0,0.0,0.0,0.0,0.0
36.0,1.0,55.0,11.0,279.0,145.0,0.0,0.0,0.0,0.0,0.0,0.0
37.0,1.0,51.0,20.0,365.0,198.0,0.0,0.0,0.0,0.0,0.0,0.0
38.0,2.0,17.0,13.0,199.0,157.0,0.0,0.0,0.0,0.0,0.0,0.0
39.0,2.0,13.0,28.0,254.0,148.0,0.0,0.0,0.0,0.0,0.0,0.0
40.0,2.0,69.0,13.0,167.0,149.0,0.0,0.0,1.0,0.0,0.0,0.0
41.0,1.0,68.0,65.0,243.0,104.0,0.0,0.0,0.0,1.0,0.0,0.0
42.0,1.0,65.0,15.0,244.0,102.0,0.0,0.0,1.0,0.0,0.0,0.0
43.0,2.0,74.0,9.0,224.0,349.0,1.0,0.0,0.0,0.0,0.0,0.0
44.0,2.0,47.0,16.0,293.0,202.0,0.0,0.0,0.0,0.0,0.0,0.0
45.0,2.0,77.0,12.0,225.0,130.0,0.0,0.0,0.0,0.0,0.0,0.0
46.0,2.0,16.0,43.0,273.0,311.0,0.0,0.0,0.0,0.0,0.0,0.0
47.0,1.0,66.0,27.0,770.0,187.0,0.0,0.0,0.0,0.0,0.0,0.0
48.0,1.0,76.0,32.0,194.0,,0.0,0.0,0.0,0.0,0.0,0.0
49.0,1.0,83.0,37.0,458.0,362.0,0.0,0.0,0.0,0.0,0.0,0.0
50.0,1.0,73.0,42.0,393.0,153.0,0.0,0.0,1.0,0.0,0.0,0.0
51.0,2.0,72.0,43.0,419.0,255.0,0.0,0.0,0.0,0.0,0.0,0.0
52.0,1.0,83.0,30.0,366.0,265.0,1.0,0.0,0.0,0.0,0.0,1.0
53.0,1.0,79.0,22.0,217.0,252.0,1.0,0.0,0.0,0.0,0.0,1.0
54.0,1.0,90.0,20.0,190.0,95.0,0.0,1.0,0.0,0.0,0.0,1.0
55.0,1.0,70.0,15.0,225.0,152.0,0.0,0.0,0.0,0.0,0.0,0.0
56.0,1.0,59.0,13.0,339.0,117.0,0.0,0.0,0.0,0.0,1.0,0.0
57.0,1.0,77.0,58.0,371.0,299.0,0.0,0.0,0.0,0.0,1.0,0.0
58.0,2.0,44.0,20.0,180.0,231.0,1.0,0.0,0.0,0.0,0.0,0.0
59.0,1.0,61.0,27.0,370.0,124.0,0.0,0.0,0.0,0.0,0.0,0.0
60.0,2.0,76.0,29.0,200.0,205.0,0.0,0.0,0.0,0.0,0.0,0.0
61.0,1.0,80.0,33.0,399.0,188.0,1.0,0.0,0.0,0.0,0.0,1.0
62.0,2.0,49.0,17.0,613.0,188.0,0.0,0.0,0.0,0.0,0.0,0.0
63.0,2.0,94.0,20.0,268.0,453.0,0.0,0.0,0.0,0.0,0.0,0.0
64.0,2.0,86.0,30.0,379.0,205.0,1.0,0.0,0.0,0.0,0.0,1.0
65.0,1.0,82.0,15.0,408.0,325.0,0.0,0.0,0.0,0.0,0.0,0.0
66.0,2.0,80.0,27.0,277.0,,0.0,0.0,1.0,0.0,0.0,1.0
67.0,1.0,80.0,,178.0,246.0,0.0,0.0,0.0,0.0,0.0,0.0
68.0,1.0,79.0,31.0,309.0,222.0,0.0,0.0,0.0,0.0,0.0,1.0
69.0,1.0,68.0,26.0,318.0,215.0,1.0,0.0,0.0,0.0,0.0,0.0
70.0,1.0,92.0,72.0,380.0,105.0,0.0,0.0,0.0,1.0,0.0,1.0
71.0,1.0,74.0,47.0,387.0,94.0,0.0,0.0,0.0,0.0,0.0,1.0
72.0,1.0,77.0,20.0,411.0,126.0,0.0,0.0,0.0,0.0,0.0,0.0
73.0,1.0,65.0,,337.0,151.0,0.0,0.0,0.0,0.0,0.0,0.0
74.0,2.0,69.0,31.0,245.0,135.0,0.0,0.0,0.0,0.0,0.0,0.0
75.0,1.0,64.0,19.0,207.0,194.0,1.0,0.0,0.0,0.0,0.0,0.0
76.0,1.0,85.0,16.0,629.0,94.0,0.0,0.0,0.0,0.0,0.0,0.0
77.0,1.0,52.0,17.0,358.0,,0.0,0.0,0.0,0.0,0.0,0.0
78.0,1.0,75.0,,380.0,,0.0,0.0,0.0,0.0,0.0,1.0
79.0,2.0,36.0,25.0,476.0,57.0,0.0,0.0,0.0,0.0,0.0,0.0
80.0,1.0,92.0,29.0,615.0,259.0,0.0,0.0,0.0,0.0,0.0,1.0
81.0,1.0,61.0,22.0,267.0,186.0,0.0,0.0,0.0,0.0,0.0,0.0
82.0,2.0,74.0,29.0,365.0,177.0,1.0,0.0,0.0,0.0,0.0,0.0
83.0,1.0,58.0,46.0,380.0,154.0,0.0,0.0,0.0,0.0,0.0,0.0
84.0,1.0,2.0,20.0,277.0,108.0,0.0,0.0,0.0,0.0,0.0,0.0
85.0,1.0,73.0,35.0,462.0,118.0,1.0,0.0,0.0,0.0,0.0,1.0
86.0,2.0,33.0,20.0,842.0,82.0,0.0,0.0,0.0,0.0,0.0,0.0
87.0,1.0,77.0,53.0,672.0,186.0,0.0,0.0,0.0,1.0,0.0,1.0
88.0,1.0,74.0,44.0,293.0,224.0,0.0,0.0,0.0,0.0,0.0,1.0
89.0,1.0,72.0,,254.0,143.0,0.0,0.0,0.0,1.0,0.0,1.0
90.0,1.0,74.0,19.0,331.0,229.0,1.0,0.0,0.0,0.0,1.0,1.0
91.0,1.0,77.0,,211.0,138.0,0.0,0.0,0.0,0.0,0.0,1.0
92.0,2.0,53.0,48.0,248.0,101.0,0.0,0.0,0.0,0.0,0.0,0.0
93.0,1.0,62.0,,380.0,338.0,0.0,0.0,0.0,0.0,0.0,1.0
94.0,1.0,74.0,63.0,332.0,216.0,0.0,0.0,0.0,1.0,0.0,1.0
95.0,2.0,60.0,42.0,473.0,196.0,0.0,0.0,0.0,0.0,0.0,0.0
96.0,1.0,71.0,42.0,330.0,219.0,1.0,0.0,0.0,0.0,0.0,0.0
97.0,2.0,78.0,15.0,590.0,279.0,1.0,1.0,0.0,0.0,0.0,0.0
98.0,2.0,61.0,38.0,233.0,304.0,0.0,0.0,0.0,0.0,0.0,0.0
99.0,2.0,80.0,84.0,576.0,170.0,0.0,0.0,0.0,0.0,0.0,0.0
100.0,1.0,80.0,,290.0,144.0,0.0,0.0,0.0,0.0,0.0,1.0
101.0,2.0,73.0,41.0,567.0,353.0,0.0,0.0,0.0,0.0,0.0,0.0
102.0,1.0,69.0,33.0,393.0,165.0,,,,,,0.0
103.0,1.0,77.0,,486.0,155.0,0.0,0.0,0.0,0.0,0.0,1.0
104.0,1.0,50.0,43.0,329.0,94.0,0.0,0.0,0.0,0.0,0.0,0.0
105.0,1.0,53.0,,365.0,188.0,0.0,0.0,0.0,0.0,0.0,0.0
106.0,1.0,52.0,29.0,339.0,134.0,0.0,0.0,0.0,0.0,0.0,0.0
107.0,1.0,57.0,28.0,278.0,152.0,0.0,0.0,0.0,0.0,0.0,0.0
108.0,2.0,83.0,145.0,1106.0,204.0,0.0,0.0,0.0,0.0,0.0,0.0
109.0,1.0,64.0,26.0,416.0,417.0,0.0,0.0,0.0,0.0,0.0,0.0
110.0,1.0,59.0,81.0,372.0,308.0,0.0,0.0,0.0,0.0,0.0,0.0
111.0,2.0,69.0,19.0,258.0,171.0,0.0,0.0,0.0,0.0,0.0,0.0
112.0,2.0,72.0,37.0,426.0,135.0,0.0,0.0,0.0,0.0,0.0,1.0
113.0,2.0,82.0,16.0,413.0,181.0,0.0,0.0,0.0,0.0,0.0,1.0
114.0,1.0,54.0,,219.0,227.0,0.0,0.0,0.0,0.0,0.0,0.0
115.0,1.0,67.0,27.0,214.0,154.0,0.0,0.0,0.0,1.0,0.0,0.0
116.0,2.0,81.0,21.0,322.0,239.0,0.0,1.0,0.0,0.0,0.0,0.0
117.0,1.0,43.0,32.0,1224.0,239.0,0.0,0.0,0.0,0.0,0.0,0.0
118.0,1.0,82.0,,263.0,184.0,0.0,0.0,0.0,0.0,0.0,0.0
119.0,1.0,60.0,68.0,539.0,125.0,0.0,0.0,0.0,0.0,0.0,0.0
120.0,1.0,44.0,,280.0,116.0,,,,,,0.0
121.0,1.0,80.0,19.0,246.0,122.0,1.0,0.0,0.0,1.0,0.0,1.0
122.0,1.0,72.0,37.0,380.0,192.0,0.0,0.0,0.0,0.0,0.0,1.0
123.0,1.0,82.0,,384.0,211.0,0.0,0.0,0.0,0.0,0.0,0.0
124.0,1.0,66.0,30.0,304.0,136.0,1.0,0.0,0.0,1.0,0.0,1.0
125.0,2.0,60.0,49.0,365.0,317.0,0.0,0.0,0.0,0.0,0.0,0.0
126.0,1.0,73.0,49.0,567.0,,0.0,0.0,0.0,0.0,0.0,1.0
127.0,2.0,33.0,23.0,679.0,105.0,0.0,0.0,0.0,0.0,0.0,0.0
128.0,1.0,76.0,24.0,309.0,142.0,0.0,0.0,0.0,0.0,0.0,1.0
129.0,1.0,70.0,39.0,796.0,107.0,0.0,0.0,0.0,0.0,0.0,1.0
130.0,1.0,71.0,35.0,353.0,145.0,0.0,0.0,0.0,1.0,0.0,0.0
131.0,2.0,73.0,37.0,273.0,130.0,0.0,0.0,0.0,0.0,0.0,1.0
132.0,1.0,85.0,27.0,832.0,274.0,0.0,0.0,0.0,0.0,0.0,0.0
133.0,1.0,83.0,61.0,587.0,206.0,0.0,0.0,0.0,1.0,0.0,1.0
134.0,1.0,81.0,35.0,380.0,237.0,0.0,0.0,0.0,0.0,0.0,1.0
135.0,1.0,61.0,37.0,349.0,112.0,,,,,,0.0
136.0,1.0,43.0,,409.0,221.0,0.0,0.0,0.0,0.0,0.0,0.0
137.0,1.0,16.0,30.0,331.0,118.0,,,,,,0.0
138.0,1.0,80.0,15.0,317.0,245.0,0.0,0.0,0.0,0.0,0.0,1.0
139.0,1.0,79.0,14.0,631.0,,,,,,,0.0
140.0,1.0,65.0,26.0,533.0,341.0,0.0,0.0,0.0,0.0,0.0,0.0
141.0,2.0,90.0,19.0,273.0,128.0,0.0,0.0,0.0,0.0,0.0,1.0
142.0,1.0,71.0,16.0,239.0,367.0,0.0,0.0,0.0,0.0,0.0,1.0
143.0,1.0,84.0,75.0,583.0,221.0,0.0,1.0,0.0,0.0,0.0,0.0
144.0,1.0,74.0,46.0,566.0,254.0,1.0,0.0,0.0,0.0,0.0,1.0
145.0,1.0,78.0,24.0,407.0,,0.0,0.0,0.0,0.0,0.0,0.0
146.0,1.0,70.0,17.0,272.0,196.0,0.0,0.0,0.0,0.0,0.0,1.0
147.0,1.0,65.0,,652.0,290.0,0.0,0.0,0.0,0.0,0.0,0.0
148.0,1.0,57.0,31.0,545.0,203.0,0.0,0.0,0.0,0.0,0.0,1.0
149.0,1.0,97.0,30.0,345.0,186.0,0.0,0.0,0.0,0.0,0.0,1.0
150.0,1.0,26.0,28.0,411.0,284.0,0.0,0.0,0.0,0.0,0.0,0.0
151.0,1.0,65.0,14.0,328.0,47.0,0.0,0.0,0.0,0.0,0.0,1.0
152.0,1.0,77.0,23.0,495.0,108.0,0.0,1.0,0.0,1.0,0.0,1.0
153.0,1.0,79.0,,380.0,186.0,0.0,0.0,0.0,1.0,1.0,1.0
154.0,1.0,89.0,77.0,543.0,201.0,0.0,0.0,0.0,0.0,0.0,1.0
155.0,1.0,77.0,41.0,333.0,203.0,0.0,0.0,0.0,0.0,0.0,1.0
156.0,1.0,85.0,138.0,591.0,176.0,0.0,0.0,0.0,0.0,0.0,1.0
157.0,2.0,72.0,30.0,248.0,341.0,0.0,0.0,0.0,0.0,0.0,0.0
158.0,1.0,82.0,20.0,323.0,109.0,0.0,0.0,0.0,0.0,0.0,0.0
159.0,1.0,42.0,34.0,334.0,348.0,0.0,0.0,0.0,0.0,0.0,0.0
160.0,2.0,56.0,75.0,414.0,175.0,0.0,0.0,0.0,0.0,0.0,0.0
161.0,1.0,80.0,,430.0,204.0,0.0,0.0,0.0,1.0,0.0,1.0
162.0,1.0,86.0,39.0,380.0,178.0,0.0,0.0,0.0,0.0,1.0,1.0
163.0,1.0,78.0,9.0,604.0,158.0,0.0,1.0,0.0,0.0,0.0,1.0
164.0,1.0,83.0,60.0,946.0,421.0,0.0,0.0,0.0,0.0,0.0,0.0
165.0,1.0,76.0,21.0,197.0,473.0,0.0,0.0,0.0,0.0,0.0,0.0
166.0,2.0,81.0,21.0,369.0,152.0,0.0,0.0,0.0,0.0,0.0,0.0
167.0,1.0,83.0,19.0,415.0,298.0,0.0,0.0,0.0,1.0,0.0,1.0
168.0,1.0,75.0,,336.0,225.0,1.0,0.0,0.0,0.0,1.0,0.0
169.0,1.0,59.0,25.0,574.0,32.0,0.0,0.0,0.0,0.0,0.0,0.0
170.0,1.0,79.0,38.0,487.0,127.0,1.0,0.0,0.0,0.0,0.0,1.0
171.0,1.0,69.0,49.0,390.0,435.0,0.0,0.0,0.0,0.0,1.0,0.0
172.0,2.0,82.0,52.0,518.0,46.0,0.0,0.0,1.0,0.0,1.0,1.0
173.0,1.0,73.0,51.0,250.0,694.0,0.0,0.0,0.0,0.0,0.0,1.0
174.0,2.0,85.0,47.0,399.0,244.0,0.0,0.0,0.0,0.0,0.0,1.0
175.0,2.0,71.0,44.0,582.0,191.0,0.0,0.0,0.0,0.0,0.0,0.0
176.0,1.0,58.0,35.0,566.0,554.0,0.0,0.0,0.0,0.0,0.0,0.0
177.0,1.0,71.0,60.0,241.0,442.0,0.0,0.0,0.0,0.0,0.0,0.0
178.0,2.0,80.0,,365.0,259.0,0.0,0.0,0.0,0.0,0.0,0.0
179.0,1.0,66.0,42.0,485.0,158.0,0.0,0.0,0.0,0.0,0.0,0.0
180.0,1.0,63.0,14.0,274.0,174.0,0.0,0.0,0.0,0.0,0.0,0.0
181.0,1.0,69.0,12.0,272.0,302.0,0.0,0.0,0.0,0.0,0.0,1.0
182.0,1.0,73.0,59.0,446.0,137.0,,,,,,0.0
183.0,2.0,65.0,122.0,347.0,,0.0,0.0,0.0,0.0,0.0,1.0
184.0,1.0,79.0,24.0,437.0,305.0,0.0,0.0,0.0,0.0,0.0,0.0
185.0,1.0,42.0,31.0,488.0,310.0,,,,,,0.0
186.0,2.0,94.0,250.0,1058.0,300.0,0.0,1.0,0.0,0.0,0.0,1.0
187.0,1.0,83.0,17.0,262.0,345.0,1.0,0.0,0.0,0.0,0.0,1.0
188.0,1.0,77.0,,529.0,451.0,0.0,0.0,0.0,1.0,0.0,0.0
189.0,1.0,38.0,15.0,234.0,167.0,1.0,0.0,0.0,0.0,0.0,1.0
190.0,2.0,79.0,35.0,350.0,275.0,0.0,0.0,0.0,0.0,0.0,0.0
191.0,1.0,57.0,23.0,185.0,163.0,0.0,0.0,0.0,1.0,0.0,1.0
192.0,1.0,75.0,58.0,583.0,117.0,,,,,,0.0
193.0,1.0,85.0,76.0,222.0,96.0,0.0,0.0,0.0,0.0,0.0,1.0
194.0,2.0,88.0,,189.0,76.0,1.0,0.0,0.0,0.0,0.0,1.0
195.0,1.0,69.0,57.0,365.0,194.0,0.0,1.0,0.0,0.0,0.0,0.0
196.0,1.0,57.0,44.0,296.0,347.0,0.0,0.0,0.0,0.0,0.0,0.0
197.0,2.0,90.0,31.0,523.0,220.0,1.0,0.0,0.0,0.0,1.0,1.0
198.0,1.0,73.0,10.0,168.0,138.0,0.0,0.0,0.0,0.0,0.0,1.0
199.0,1.0,67.0,59.0,365.0,274.0,0.0,0.0,0.0,0.0,0.0,0.0
200.0,1.0,60.0,15.0,336.0,236.0,0.0,0.0,0.0,0.0,0.0,0.0
201.0,2.0,82.0,15.0,380.0,246.0,0.0,0.0,0.0,0.0,0.0,1.0
202.0,1.0,82.0,33.0,655.0,429.0,0.0,0.0,0.0,0.0,0.0,0.0
203.0,2.0,68.0,51.0,382.0,120.0,0.0,0.0,0.0,0.0,0.0,0.0
204.0,2.0,53.0,10.0,302.0,201.0,0.0,0.0,0.0,0.0,0.0,0.0
205.0,1.0,79.0,,274.0,289.0,1.0,0.0,0.0,0.0,0.0,0.0
206.0,2.0,78.0,27.0,397.0,95.0,0.0,0.0,0.0,0.0,0.0,1.0
207.0,1.0,69.0,19.0,380.0,272.0,1.0,0.0,0.0,1.0,0.0,1.0
208.0,2.0,45.0,40.0,622.0,310.0,0.0,0.0,0.0,0.0,0.0,0.0
209.0,1.0,79.0,22.0,272.0,172.0,1.0,0.0,0.0,1.0,0.0,1.0
210.0,1.0,73.0,13.0,347.0,332.0,1.0,0.0,0.0,0.0,0.0,1.0
211.0,1.0,74.0,25.0,433.0,177.0,0.0,1.0,0.0,1.0,0.0,0.0
212.0,1.0,62.0,45.0,238.0,168.0,0.0,0.0,0.0,0.0,0.0,0.0
213.0,1.0,68.0,40.0,316.0,171.0,1.0,0.0,0.0,0.0,0.0,0.0
214.0,2.0,85.0,24.0,438.0,155.0,0.0,0.0,0.0,0.0,0.0,1.0
215.0,1.0,69.0,89.0,357.0,110.0,,,,,,0.0
216.0,1.0,30.0,,365.0,196.0,0.0,0.0,0.0,0.0,0.0,0.0
217.0,1.0,73.0,24.0,343.0,234.0,0.0,0.0,0.0,0.0,0.0,0.0
218.0,1.0,59.0,83.0,748.0,277.0,0.0,0.0,0.0,0.0,0.0,0.0
219.0,1.0,79.0,99.0,502.0,122.0,0.0,0.0,0.0,0.0,0.0,0.0
220.0,2.0,56.0,32.0,424.0,80.0,1.0,0.0,0.0,0.0,0.0,0.0
221.0,1.0,66.0,21.0,257.0,96.0,0.0,0.0,0.0,0.0,0.0,0.0
222.0,1.0,80.0,32.0,344.0,219.0,0.0,0.0,0.0,0.0,0.0,0.0
223.0,1.0,72.0,25.0,433.0,248.0,0.0,0.0,0.0,0.0,0.0,1.0
224.0,2.0,82.0,,355.0,166.0,0.0,0.0,0.0,0.0,0.0,1.0
225.0,2.0,59.0,35.0,178.0,142.0,0.0,0.0,0.0,0.0,0.0,0.0
226.0,2.0,73.0,,365.0,,,,,,,0.0
227.0,1.0,79.0,,380.0,152.0,0.0,0.0,0.0,1.0,0.0,1.0
228.0,1.0,47.0,,365.0,218.0,0.0,0.0,0.0,0.0,0.0,0.0
229.0,1.0,33.0,11.0,345.0,198.0,0.0,0.0,0.0,0.0,0.0,0.0
230.0,1.0,66.0,20.0,352.0,238.0,0.0,0.0,0.0,0.0,0.0,0.0
231.0,2.0,85.0,36.0,347.0,313.0,0.0,0.0,0.0,0.0,0.0,1.0
232.0,1.0,46.0,86.0,449.0,338.0,0.0,0.0,0.0,0.0,0.0,0.0
233.0,2.0,44.0,,365.0,,0.0,0.0,0.0,0.0,0.0,0.0
234.0,1.0,67.0,92.0,1140.0,319.0,0.0,0.0,0.0,0.0,0.0,1.0
235.0,1.0,41.0,22.0,381.0,184.0,0.0,0.0,0.0,0.0,0.0,0.0
236.0,2.0,79.0,,380.0,394.0,0.0,0.0,0.0,0.0,0.0,1.0
237.0,1.0,79.0,,380.0,252.0,0.0,0.0,0.0,0.0,0.0,1.0
238.0,2.0,79.0,26.0,672.0,348.0,,,,,,0.0
239.0,2.0,40.0,31.0,562.0,303.0,0.0,0.0,0.0,0.0,0.0,0.0
240.0,1.0,57.0,37.0,206.0,308.0,,,,,,0.0
241.0,2.0,42.0,10.0,239.0,207.0,0.0,0.0,0.0,0.0,0.0,0.0
242.0,1.0,79.0,54.0,511.0,345.0,0.0,0.0,0.0,1.0,0.0,1.0
243.0,2.0,50.0,36.0,525.0,179.0,0.0,0.0,0.0,0.0,0.0,0.0
244.0,2.0,52.0,29.0,459.0,189.0,,,,,,0.0
245.0,2.0,73.0,30.0,392.0,217.0,1.0,0.0,0.0,0.0,0.0,0.0
246.0,1.0,31.0,20.0,176.0,239.0,0.0,0.0,0.0,0.0,0.0,0.0
247.0,1.0,46.0,20.0,400.0,168.0,0.0,0.0,0.0,0.0,1.0,0.0
248.0,1.0,63.0,,380.0,121.0,0.0,0.0,0.0,0.0,0.0,1.0
249.0,1.0,80.0,34.0,171.0,291.0,0.0,1.0,0.0,0.0,0.0,0.0
250.0,2.0,84.0,22.0,392.0,201.0,0.0,0.0,0.0,0.0,0.0,1.0
251.0,1.0,61.0,37.0,422.0,133.0,0.0,0.0,0.0,1.0,1.0,1.0
252.0,2.0,72.0,18.0,497.0,159.0,0.0,0.0,0.0,0.0,0.0,0.0
253.0,2.0,48.0,39.0,334.0,91.0,0.0,0.0,0.0,0.0,0.0,0.0
254.0,1.0,73.0,140.0,462.0,378.0,0.0,0.0,0.0,0.0,0.0,1.0
255.0,2.0,86.0,69.0,482.0,436.0,1.0,0.0,0.0,1.0,0.0,0.0
256.0,2.0,47.0,23.0,403.0,155.0,0.0,0.0,0.0,0.0,0.0,0.0
257.0,1.0,59.0,19.0,453.0,253.0,0.0,0.0,0.0,0.0,0.0,1.0
258.0,1.0,98.0,34.0,351.0,327.0,0.0,0.0,0.0,0.0,0.0,1.0
259.0,1.0,63.0,74.0,347.0,200.0,1.0,0.0,0.0,0.0,1.0,1.0
260.0,2.0,75.0,12.0,406.0,235.0,0.0,0.0,0.0,0.0,0.0,0.0
261.0,1.0,49.0,70.0,333.0,168.0,0.0,0.0,0.0,0.0,0.0,0.0
262.0,1.0,67.0,70.0,253.0,246.0,0.0,0.0,0.0,0.0,0.0,1.0
263.0,2.0,76.0,41.0,360.0,334.0,0.0,0.0,0.0,0.0,1.0,0.0
264.0,1.0,43.0,20.0,266.0,362.0,0.0,0.0,0.0,0.0,0.0,0.0
265.0,1.0,51.0,176.0,443.0,169.0,0.0,0.0,0.0,0.0,0.0,0.0
266.0,1.0,76.0,66.0,439.0,156.0,,,,,,1.0
267.0,1.0,61.0,29.0,521.0,230.0,0.0,0.0,0.0,0.0,0.0,0.0
268.0,2.0,54.0,49.0,369.0,551.0,0.0,0.0,0.0,0.0,0.0,0.0
269.0,1.0,77.0,36.0,463.0,61.0,0.0,0.0,0.0,0.0,0.0,0.0
270.0,1.0,73.0,31.0,276.0,304.0,0.0,0.0,0.0,0.0,0.0,1.0
271.0,2.0,29.0,76.0,489.0,135.0,0.0,0.0,0.0,0.0,0.0,0.0
272.0,1.0,65.0,68.0,494.0,281.0,1.0,0.0,0.0,0.0,0.0,0.0
273.0,1.0,65.0,55.0,415.0,191.0,0.0,0.0,0.0,0.0,0.0,0.0
274.0,2.0,63.0,73.0,348.0,333.0,0.0,0.0,1.0,0.0,0.0,0.0
275.0,1.0,78.0,26.0,616.0,63.0,0.0,0.0,0.0,1.0,0.0,1.0
276.0,1.0,44.0,22.0,338.0,415.0,0.0,0.0,0.0,0.0,0.0,0.0
277.0,1.0,77.0,82.0,356.0,182.0,0.0,0.0,0.0,0.0,0.0,1.0
278.0,1.0,48.0,44.0,437.0,170.0,0.0,0.0,0.0,0.0,0.0,0.0
279.0,1.0,76.0,39.0,482.0,156.0,0.0,0.0,0.0,0.0,0.0,1.0
280.0,1.0,78.0,19.0,876.0,155.0,,,,,,0.0
281.0,1.0,71.0,19.0,323.0,182.0,0.0,0.0,0.0,0.0,0.0,1.0
282.0,2.0,63.0,39.0,681.0,293.0,,,,,,0.0
283.0,1.0,72.0,117.0,534.0,250.0,,,,,,0.0
284.0,1.0,80.0,42.0,447.0,201.0,1.0,0.0,0.0,0.0,0.0,0.0
285.0,1.0,47.0,19.0,605.0,844.0,,,,,,0.0
286.0,1.0,51.0,36.0,501.0,151.0,1.0,0.0,0.0,0.0,0.0,0.0
287.0,1.0,51.0,29.0,366.0,246.0,0.0,0.0,0.0,0.0,0.0,0.0
288.0,2.0,64.0,30.0,461.0,182.0,0.0,0.0,0.0,0.0,0.0,0.0
289.0,1.0,66.0,53.0,694.0,251.0,0.0,0.0,0.0,0.0,0.0,1.0
290.0,1.0,49.0,41.0,354.0,263.0,,,,,,0.0
291.0,1.0,59.0,56.0,755.0,276.0,0.0,0.0,0.0,0.0,0.0,1.0
292.0,2.0,65.0,190.0,1235.0,345.0,,,,,,1.0
293.0,1.0,65.0,29.0,504.0,68.0,0.0,0.0,0.0,0.0,1.0,1.0
294.0,1.0,50.0,71.0,315.0,121.0,,,,,,0.0
295.0,2.0,86.0,31.0,593.0,193.0,0.0,0.0,1.0,0.0,0.0,1.0
296.0,1.0,70.0,53.0,382.0,290.0,1.0,0.0,0.0,0.0,1.0,1.0
297.0,1.0,65.0,88.0,1631.0,75.0,,,,,,0.0
298.0,2.0,71.0,53.0,616.0,194.0,0.0,1.0,0.0,0.0,0.0,0.0
299.0,1.0,73.0,26.0,359.0,290.0,0.0,0.0,0.0,0.0,0.0,1.0
300.0,2.0,49.0,38.0,452.0,151.0,0.0,0.0,0.0,0.0,0.0,0.0
301.0,2.0,97.0,121.0,359.0,171.0,0.0,0.0,0.0,0.0,0.0,1.0
302.0,1.0,56.0,197.0,346.0,340.0,,,,,,0.0
303.0,2.0,57.0,31.0,317.0,201.0,1.0,0.0,0.0,0.0,0.0,1.0
304.0,2.0,78.0,23.0,160.0,140.0,0.0,0.0,0.0,1.0,0.0,1.0
305.0,1.0,59.0,10.0,1132.0,219.0,0.0,0.0,0.0,0.0,0.0,1.0
306.0,1.0,73.0,146.0,343.0,317.0,0.0,0.0,0.0,0.0,0.0,1.0
307.0,1.0,80.0,128.0,534.0,596.0,0.0,0.0,0.0,1.0,0.0,1.0
308.0,1.0,63.0,28.0,668.0,194.0,0.0,0.0,0.0,0.0,0.0,0.0
309.0,2.0,55.0,90.0,489.0,86.0,0.0,0.0,0.0,0.0,0.0,0.0
310.0,1.0,66.0,98.0,232.0,344.0,0.0,0.0,0.0,0.0,0.0,0.0
311.0,1.0,62.0,41.0,516.0,389.0,1.0,0.0,0.0,0.0,0.0,1.0
312.0,1.0,57.0,18.0,446.0,195.0,0.0,0.0,0.0,0.0,0.0,0.0
313.0,2.0,59.0,40.0,1532.0,283.0,0.0,0.0,0.0,0.0,0.0,1.0
314.0,1.0,71.0,,524.0,254.0,0.0,0.0,0.0,0.0,1.0,1.0
315.0,1.0,38.0,19.0,245.0,478.0,0.0,0.0,0.0,0.0,0.0,0.0
316.0,2.0,70.0,17.0,298.0,255.0,,,,,,0.0
317.0,1.0,69.0,41.0,527.0,313.0,,,,,,0.0
318.0,1.0,61.0,35.0,410.0,231.0,0.0,0.0,0.0,0.0,0.0,0.0
319.0,1.0,56.0,81.0,310.0,295.0,0.0,0.0,0.0,0.0,0.0,0.0
320.0,2.0,89.0,35.0,346.0,148.0,,,,,,1.0
321.0,1.0,73.0,16.0,390.0,320.0,0.0,0.0,0.0,0.0,0.0,0.0
322.0,2.0,75.0,37.0,319.0,266.0,0.0,0.0,0.0,0.0,0.0,0.0
323.0,1.0,64.0,29.0,357.0,300.0,,,,,,0.0
324.0,1.0,44.0,10.0,458.0,296.0,0.0,0.0,0.0,0.0,0.0,0.0
325.0,1.0,57.0,27.0,605.0,215.0,0.0,0.0,0.0,0.0,0.0,0.0
326.0,1.0,56.0,69.0,328.0,351.0,0.0,0.0,0.0,0.0,0.0,0.0
327.0,2.0,66.0,118.0,260.0,201.0,,,,,,0.0
328.0,1.0,55.0,68.0,434.0,349.0,0.0,1.0,0.0,0.0,0.0,1.0
329.0,1.0,61.0,,423.0,112.0,0.0,0.0,0.0,1.0,0.0,0.0
330.0,2.0,86.0,20.0,414.0,233.0,0.0,0.0,0.0,0.0,0.0,1.0
331.0,1.0,43.0,,381.0,244.0,0.0,0.0,0.0,0.0,0.0,0.0
332.0,2.0,61.0,23.0,441.0,270.0,1.0,0.0,0.0,0.0,0.0,1.0
333.0,1.0,69.0,34.0,1002.0,230.0,0.0,0.0,0.0,1.0,0.0,0.0
334.0,2.0,51.0,47.0,1138.0,,0.0,0.0,0.0,0.0,0.0,0.0
335.0,1.0,58.0,34.0,256.0,230.0,0.0,0.0,0.0,0.0,0.0,0.0
336.0,2.0,74.0,38.0,1045.0,306.0,0.0,0.0,0.0,0.0,0.0,0.0
337.0,1.0,70.0,48.0,442.0,221.0,,,,,,0.0
338.0,1.0,75.0,116.0,334.0,216.0,1.0,1.0,0.0,1.0,0.0,1.0
339.0,2.0,80.0,36.0,615.0,214.0,0.0,0.0,0.0,0.0,0.0,0.0
340.0,1.0,90.0,27.0,400.0,144.0,0.0,0.0,0.0,0.0,0.0,1.0
341.0,2.0,47.0,30.0,380.0,434.0,0.0,0.0,0.0,0.0,0.0,0.0
342.0,1.0,41.0,40.0,437.0,326.0,0.0,0.0,0.0,0.0,0.0,0.0
343.0,2.0,87.0,88.0,441.0,111.0,0.0,0.0,0.0,0.0,0.0,1.0
344.0,1.0,52.0,18.0,399.0,217.0,0.0,0.0,0.0,0.0,0.0,0.0
345.0,1.0,65.0,33.0,288.0,353.0,,,,,,0.0
346.0,1.0,56.0,,365.0,124.0,0.0,0.0,0.0,0.0,0.0,0.0
347.0,1.0,52.0,217.0,362.0,158.0,,,,,,0.0
348.0,1.0,63.0,,401.0,160.0,0.0,0.0,0.0,0.0,0.0,0.0
349.0,1.0,57.0,2114.0,458.0,324.0,1.0,0.0,0.0,0.0,0.0,0.0
350.0,1.0,62.0,134.0,430.0,163.0,0.0,0.0,0.0,0.0,0.0,1.0
351.0,2.0,77.0,133.0,339.0,296.0,0.0,0.0,0.0,0.0,0.0,0.0
352.0,1.0,65.0,40.0,867.0,266.0,,,,,,0.0
353.0,2.0,67.0,41.0,326.0,277.0,0.0,0.0,0.0,0.0,1.0,1.0
354.0,2.0,43.0,61.0,502.0,242.0,0.0,0.0,0.0,0.0,0.0,0.0
355.0,2.0,72.0,102.0,653.0,75.0,0.0,0.0,0.0,0.0,0.0,1.0
356.0,1.0,64.0,27.0,1385.0,272.0,1.0,0.0,0.0,0.0,0.0,0.0
357.0,1.0,60.0,31.0,466.0,163.0,1.0,0.0,0.0,0.0,0.0,0.0
358.0,1.0,60.0,39.0,318.0,365.0,1.0,0.0,0.0,0.0,0.0,0.0
359.0,1.0,50.0,,355.0,188.0,0.0,0.0,0.0,0.0,0.0,0.0
360.0,2.0,51.0,,395.0,205.0,,,,,,0.0
361.0,1.0,70.0,,812.0,318.0,,,,,,0.0
362.0,1.0,54.0,,365.0,300.0,,,,,,0.0
363.0,2.0,73.0,,451.0,431.0,0.0,0.0,0.0,0.0,0.0,0.0
364.0,1.0,53.0,,525.0,269.0,0.0,0.0,0.0,0.0,0.0,0.0
365.0,1.0,78.0,,213.0,146.0,1.0,0.0,0.0,0.0,0.0,0.0
366.0,1.0,70.0,91.0,280.0,452.0,,,,,,0.0
367.0,1.0,72.0,,280.0,133.0,1.0,0.0,0.0,0.0,0.0,0.0
368.0,1.0,58.0,,365.0,199.0,0.0,0.0,0.0,0.0,0.0,0.0
369.0,1.0,63.0,,222.0,370.0,1.0,0.0,0.0,0.0,0.0,0.0
370.0,1.0,66.0,,314.0,175.0,,,,,,0.0
371.0,1.0,76.0,,529.0,87.0,0.0,0.0,1.0,0.0,0.0,1.0
372.0,2.0,66.0,,365.0,151.0,0.0,0.0,0.0,0.0,0.0,0.0
373.0,1.0,78.0,17.0,267.0,225.0,0.0,0.0,0.0,1.0,0.0,1.0
374.0,2.0,84.0,,380.0,,0.0,0.0,0.0,0.0,0.0,1.0
375.0,1.0,86.0,,184.0,145.0,0.0,0.0,0.0,0.0,0.0,1.0
376.0,1.0,77.0,,286.0,149.0,0.0,0.0,0.0,0.0,0.0,0.0
377.0,1.0,58.0,,373.0,243.0,0.0,0.0,0.0,0.0,0.0,0.0
378.0,1.0,68.0,,365.0,,,,,,,0.0
379.0,1.0,77.0,,358.0,169.0,0.0,0.0,1.0,0.0,0.0,1.0
380.0,1.0,61.0,,365.0,,0.0,0.0,0.0,0.0,0.0,0.0
381.0,2.0,70.0,,365.0,130.0,0.0,0.0,0.0,0.0,0.0,0.0
382.0,2.0,82.0,,365.0,247.0,,,,,,0.0
383.0,1.0,55.0,,294.0,158.0,,,,,,0.0
384.0,2.0,77.0,,535.0,239.0,,,,,,0.0
385.0,1.0,55.0,,365.0,,0.0,0.0,0.0,0.0,1.0,0.0
386.0,2.0,88.0,,380.0,,1.0,0.0,0.0,1.0,0.0,1.0
387.0,1.0,60.0,,365.0,62.0,1.0,0.0,0.0,0.0,0.0,0.0
388.0,1.0,33.0,,365.0,157.0,,,,,,0.0
389.0,2.0,62.0,,380.0,125.0,0.0,0.0,0.0,0.0,0.0,1.0
390.0,1.0,70.0,,242.0,138.0,1.0,0.0,0.0,0.0,0.0,1.0
391.0,1.0,64.0,,417.0,121.0,,,,,,0.0
392.0,1.0,69.0,,306.0,234.0,0.0,0.0,0.0,0.0,0.0,1.0
393.0,2.0,89.0,,380.0,,0.0,1.0,0.0,0.0,0.0,1.0
394.0,1.0,61.0,,365.0,,0.0,0.0,0.0,0.0,0.0,0.0
395.0,1.0,80.0,,380.0,,1.0,1.0,0.0,0.0,0.0,1.0
396.0,1.0,68.0,,365.0,,,,,,,0.0
397.0,2.0,59.0,,365.0,,,,,,,0.0
398.0,1.0,71.0,,380.0,227.0,0.0,0.0,0.0,0.0,0.0,1.0
399.0,1.0,85.0,,380.0,42.0,0.0,0.0,0.0,0.0,0.0,1.0
400.0,1.0,40.0,,365.0,14.0,,,,,,0.0
401.0,1.0,72.0,,365.0,229.0,0.0,0.0,0.0,0.0,0.0,0.0
402.0,2.0,80.0,,380.0,100.0,0.0,0.0,0.0,0.0,0.0,1.0
403.0,1.0,69.0,,365.0,122.0,0.0,0.0,0.0,0.0,0.0,0.0
404.0,2.0,72.0,,365.0,16.0,,,,,,0.0
405.0,1.0,53.0,,365.0,149.0,1.0,0.0,1.0,0.0,0.0,0.0
406.0,2.0,74.0,,380.0,199.0,0.0,0.0,0.0,0.0,0.0,1.0
407.0,1.0,63.0,,307.0,262.0,0.0,1.0,0.0,0.0,0.0,0.0
408.0,2.0,89.0,,380.0,,0.0,0.0,1.0,0.0,0.0,1.0
409.0,1.0,61.0,,365.0,,0.0,0.0,0.0,0.0,0.0,0.0
410.0,1.0,55.0,,365.0,144.0,0.0,0.0,0.0,0.0,0.0,0.0
411.0,1.0,57.0,,365.0,64.0,0.0,0.0,0.0,0.0,1.0,0.0
412.0,2.0,79.0,,365.0,310.0,0.0,0.0,0.0,0.0,0.0,0.0
413.0,2.0,55.0,,365.0,184.0,0.0,0.0,0.0,0.0,0.0,0.0
414.0,1.0,90.0,,380.0,125.0,0.0,0.0,0.0,0.0,0.0,1.0
415.0,1.0,80.0,,380.0,239.0,0.0,0.0,0.0,0.0,0.0,1.0
416.0,2.0,67.0,,365.0,136.0,0.0,0.0,0.0,0.0,0.0,0.0
417.0,1.0,46.0,,365.0,365.0,,,,,,0.0
418.0,1.0,73.0,,365.0,,0.0,0.0,0.0,0.0,0.0,0.0
419.0,2.0,46.0,,365.0,130.0,1.0,0.0,0.0,0.0,0.0,0.0
420.0,1.0,48.0,,365.0,28.0,0.0,0.0,0.0,0.0,0.0,0.0
421.0,1.0,86.0,,380.0,86.0,0.0,1.0,0.0,0.0,0.0,1.0
422.0,2.0,85.0,,365.0,5.0,1.0,0.0,0.0,1.0,0.0,0.0
423.0,2.0,26.0,,365.0,,0.0,0.0,0.0,0.0,0.0,0.0
424.0,1.0,45.0,,365.0,,,,,,,0.0
425.0,2.0,89.0,,365.0,,0.0,0.0,0.0,0.0,0.0,0.0
426.0,1.0,78.0,,380.0,105.0,1.0,0.0,0.0,1.0,0.0,1.0
427.0,1.0,66.0,22.0,320.0,50.0,0.0,0.0,0.0,0.0,0.0,0.0
428.0,1.0,78.0,157.0,278.0,197.0,1.0,0.0,0.0,0.0,1.0,0.0
429.0,1.0,71.0,,440.0,,1.0,1.0,1.0,0.0,0.0,0.0
430.0,2.0,80.0,15.0,456.0,229.0,0.0,0.0,0.0,0.0,0.0,0.0
431.0,1.0,82.0,45.0,831.0,131.0,0.0,0.0,0.0,0.0,0.0,1.0
432.0,2.0,82.0,42.0,312.0,460.0,0.0,0.0,0.0,0.0,0.0,0.0
433.0,1.0,66.0,46.0,,226.0,0.0,0.0,0.0,0.0,0.0,0.0
434.0,1.0,65.0,102.0,,98.0,0.0,0.0,0.0,0.0,0.0,0.0
435.0,1.0,45.0,152.0,209.0,122.0,0.0,0.0,0.0,0.0,0.0,0.0
436.0,2.0,45.0,15.0,144.0,208.0,0.0,0.0,0.0,0.0,0.0,0.0
437.0,1.0,37.0,33.0,193.0,130.0,0.0,0.0,0.0,0.0,0.0,0.0
438.0,1.0,9.0,,1055.0,,0.0,0.0,0.0,0.0,0.0,0.0
439.0,1.0,80.0,30.0,390.0,181.0,1.0,0.0,0.0,0.0,0.0,1.0
440.0,1.0,20.0,251.0,1055.0,302.0,0.0,0.0,0.0,0.0,0.0,0.0
441.0,1.0,93.0,19.0,246.0,133.0,0.0,1.0,0.0,0.0,0.0,1.0
442.0,1.0,74.0,,,157.0,0.0,0.0,0.0,0.0,0.0,1.0
443.0,1.0,67.0,83.0,,160.0,0.0,0.0,0.0,0.0,0.0,0.0
444.0,1.0,63.0,74.0,57.0,293.0,0.0,0.0,0.0,0.0,0.0,1.0
445.0,1.0,56.0,77.0,404.0,259.0,0.0,0.0,0.0,0.0,0.0,0.0
446.0,1.0,49.0,25.0,210.0,214.0,0.0,0.0,0.0,0.0,0.0,0.0
447.0,1.0,41.0,64.0,414.0,192.0,0.0,0.0,0.0,0.0,0.0,0.0
448.0,1.0,72.0,,,55.0,0.0,0.0,0.0,0.0,0.0,1.0
449.0,2.0,72.0,40.0,299.0,503.0,1.0,0.0,0.0,1.0,0.0,0.0
450.0,1.0,69.0,,4501.0,,0.0,0.0,1.0,0.0,1.0,1.0
451.0,1.0,77.0,15.0,198.0,136.0,0.0,0.0,0.0,0.0,0.0,0.0
452.0,1.0,87.0,304.0,865.0,138.0,0.0,0.0,0.0,1.0,0.0,1.0
453.0,1.0,82.0,25.0,324.0,103.0,0.0,0.0,0.0,1.0,0.0,1.0