SampleID,Cohort,Patient,Visit,Assay panel 1,Unnamed: 5,Unnamed: 6,Unnamed: 7,Unnamed: 8,Unnamed: 9,Unnamed: 10,Unnamed: 11,Unnamed: 12,Unnamed: 13,Unnamed: 14,Unnamed: 15,Unnamed: 16,Unnamed: 17,Unnamed: 18,Unnamed: 19,Unnamed: 20,Unnamed: 21,Unnamed: 22,Unnamed: 23,Unnamed: 24,Unnamed: 25,Unnamed: 26,Assay panel 2,Unnamed: 28,Unnamed: 29,Unnamed: 30,Unnamed: 31,Unnamed: 32,Unnamed: 33,Unnamed: 34,Assay panel 3,Unnamed: 36,Unnamed: 37,Unnamed: 38,Unnamed: 39,Unnamed: 40,Unnamed: 41,Unnamed: 42
,,,,Leukocytes,,,,,GAPDH,,,CD4,,,,,CD8,,,,,BLC,,,,,GAPDH,,,FOXP3,,,,,GAPDH,,,NK,,,,
,,,,Cp value,Plasmid units,C.V. [%],Cell count [cells/µl],Flow data [cells/µl],Cp value,Plasmid units,C.V. [%],Cp value,Plasmid units,C.V. [%],Cell count [%],Flow data [cells/µl],Cp value,Plasmid units,C.V. [%],Cell count [%],Flow data [cells/µl],Cp value,Plasmid units,C.V. [%],Cell count [%],Flow data [cells/µl],Cp value,Plasmid units,C.V. [%],Cp value,Plasmid units,C.V. [%],Cell count [%],Flow data [cells/µl],Cp value,Plasmid units,C.V. [%],Cp value,Plasmid units,C.V. [%],Cell count [%],Flow data [cells/µl]
INVE001,healthy,healthy,healthy,23.585,6605,0.26983086837731257,4934.5696489335405,6712,	25.23,	4395.00,	8.21,	28.31,	320.50,	1.10,12.84,9.23,	29.26,	143.50,	20.20,3.93,3,	30.13,	162.00,	14.84,5.06,3.52,	26.59,	1615.00,	0.44,	35.11,	4.22,	21.31,0.46,0.74,,,,,,,,4.7
INVE002,healthy,healthy,healthy,23.765,5815,0.9818861257797579,5302.111263372194,6715,	25.08,	4835.00,	1.61,	27.34,	627.50,	17.24,22.78,17.42,	27.65,	414.50,	1.19,10.28,9.27,	30.03,	174.50,	22.29,4.94,2.94,	26.63,	1575.00,	1.35,	33.44,	14.43,	51.58,1.62,1.23,,,,,,,,6.06
INVE003,healthy,healthy,healthy,23.605,6515,0.3295138569392918,3319.233329896562,4121,	26.01,	2555.00,	0.83,	28.91,	213.00,	1.33,14.63,10.3,	29.72,	105.10,	17.36,4.93,3.12,	31.26,	74.95,	10.09,4.02,2.84,	27.28,	1020.00,	0.00,	35.18,	4.00,	1.41,0.69,0.85,,,,,,,,2
INVE004,healthy,healthy,healthy,23.695,6090,0.14921012474921025,5921.353552615537,6599,	25.02,	5045.00,	2.94,	27.57,	534.50,	3.31,18.6,15.24,	28.05,	318.00,	1.33,7.56,7.32,	30.49,	127.00,	5.57,3.45,2.57,	26.61,	1595.00,	5.76,	33.70,	11.20,	13.89,1.24,1.06,,,,,,,,2.38
INVE005,healthy,healthy,healthy,23.72,5945,0.05962114512534,3628.2433402728825,4115,	25.81,	2930.00,	2.41,	27.68,	496.00,	11.12,29.72,26.77,	27.94,	341.00,	6.64,13.96,11.74,	29.92,	186.00,	6.08,8.7,6.59,	26.65,	1555.00,	1.36,	33.04,	17.80,	1.59,2.02,1.8,,,,,,,,2.57
INVE006,healthy,healthy,healthy,23.48,7260,1.626225135607901,3165.829679668389,4634,	25.67,	3220.00,	0.88,	27.89,	429.00,	6.92,23.38,19.25,	28.28,	272.50,	1.30,10.15,8.59,	30.21,	153.00,	13.86,6.51,4.61,	26.92,	1305.00,	1.63,	33.54,	12.50,	9.05,1.69,1.98,,,,,,,,2.82
INVE007,healthy,healthy,healthy,23.585,6590,0.029981207597483916,3390.627844622079,5766,	25.26,	4280.00,	4.96,	27.32,	636.50,	14.78,26.13,21.6,	28.88,	183.50,	10.40,5.15,4.89,	33.07,	97.70,	137.95,3.13,4.2,	26.84,	1370.00,	1.03,	34.21,	8.11,	36.45,1.05,1.02,,,,,,,,4.37
INVE008,healthy,healthy,healthy,23.65,6310,0.5381785226789783,7210.376696575022,10245,	24.55,	6970.00,	4.06,	27.70,	489.50,	6.21,12.34,9.98,	27.79,	377.00,	3.00,6.49,4.6,	30.74,	106.00,	6.67,2.08,1.51,	25.81,	2725.00,	0.78,	32.97,	18.75,	7.92,1.22,0.95,,,,,,,,3.11
INVE009,healthy,healthy,healthy,24.67,3580,4.987295497627043,6258.244922754802,7903,	25.16,	4605.00,	1.69,	28.81,	231.50,	25.96,8.82,14.78,	28.79,	194.00,	nan,5.05,3.33,	29.38,	272.50,	19.98,8.1,4.89,	26.14,	2185.00,	3.56,	33.22,	16.35,	41.09,1.32,1.07,,,,,,,,3.14
INVE010,healthy,healthy,healthy,24.66,3780,5.6201512211096265,14276.860919011193,13043,	24.06,	9755.00,	0.22,	27.42,	593.00,	7.15,10.67,10,	31.55,	227.07,	140.09,2.79,7.72,	30.65,	113.00,	8.76,1.59,1.31,	24.80,	5375.00,	0.92,	32.41,	27.70,	16.34,0.91,0.61,,,,,,,,6.99
INVE011,healthy,healthy,healthy,23.67,6200,0.1792412626581831,3680.3174700997906,5443,	25.67,	3225.00,	2.41,	28.73,	241.00,	0.00,13.12,8.76,	28.62,	216.50,	5.55,8.05,6.8,	30.96,	91.25,	0.39,3.88,2.82,	26.95,	1275.00,	2.77,	34.48,	6.56,	22.33,0.91,0.7,,,,,,,,2.61
INVE012,healthy,healthy,healthy,23.675,6185,0.08960170405743285,4568.3968329082845,6017,	25.63,	3320.00,	3.41,	28.24,	339.50,	17.70,17.96,14.17,	27.85,	363.00,	1.17,13.12,11.25,	31.27,	74.55,	16.98,3.08,1.8,	26.55,	1655.00,	2.99,	33.66,	11.91,	37.88,1.27,0.94,,,,,,,,1.91
INVE013,healthy,healthy,healthy,23.799999999999997,5630,0.05942073791483467,4443.464278709921,5273,	25.81,	2930.00,	1.93,	29.12,	185.00,	6.12,11.08,8.29,	29.04,	164.00,	1.72,6.71,4.89,	31.06,	85.50,	11.41,4,2.75,	26.30,	1960.00,	0.72,	33.34,	14.45,	9.30,1.3,0.95,,,,,,,,2.21
INVE014,healthy,healthy,healthy,23.884999999999998,5285,0.029604638107040327,7626.33319102839,8767,	25.06,	4890.00,	4.34,	27.63,	512.00,	4.70,18.39,14.88,	27.42,	484.50,	9.19,11.89,12.38,	29.67,	221.00,	0.64,6.19,4.44,	25.61,	3140.00,	0.45,	33.11,	16.95,	21.28,0.95,1.07,,,,,,,,5.85
INVE015,healthy,healthy,healthy,24.215,4135,0.08760356570554297,5297.022678520845,6386,	25.93,	2700.00,	7.33,	28.56,	271.00,	0.00,17.66,15.07,	29.18,	150.50,	7.99,6.7,4.57,	31.09,	84.05,	9.00,4.27,3.52,	26.62,	1590.00,	0.89,	34.29,	7.90,	48.21,0.88,0.86,,,,,,,,5.9
INVE016,healthy,healthy,healthy,23.675,6175,0.08960170405743285,5083.802044536635,5469,	25.30,	4165.00,	1.19,	27.63,	512.50,	6.76,21.6,19.09,	27.82,	370.50,	3.63,10.67,9.8,	30.34,	140.50,	18.62,4.62,2.67,	26.50,	1720.00,	0.82,	33.62,	11.80,	5.99,1.21,1.63,,,,,,,,3.3
INVE017,healthy,healthy,healthy,24.525,3550,0.14416040391163257,4353.829395223934,5960,	25.81,	3510.00,	0.40,	28.08,	538.50,	1.18,22.69,18.93,	28.81,	244.00,	12.17,7.3,5.93,	30.37,	195.00,	15.23,7.27,4.97,	25.35,	3730.00,	6.45,	31.71,	44.95,	6.76,2.13,2.2,,,,,,,,2.63
INVE018,healthy,healthy,healthy,24.5,3640,0.17316900763752838,6756.010802688453,9180,	25.17,	5435.00,	2.21,	27.59,	749.50,	1.42,20.4,18.34,	28.30,	344.00,	3.29,6.64,5.04,	30.10,	231.00,	2.45,5.57,4.03,	24.87,	5120.00,	1.93,	31.72,	44.40,	0.00,1.53,1.05,25.72,3530,0.8012541429875893,30.57,155.5,5.911503636929337,3.7617651619467347,3.55
INVE019,healthy,healthy,healthy,24.43,3855,0.5209955817174718,12632.889134307756,10909,	24.68,	7575.00,	12.23,	27.36,	874.50,	11.89,17.2,13.69,	27.93,	441.50,	0.16,6.16,3.93,	30.08,	234.00,	4.83,4.07,2.34,	25.24,	3995.00,	1.95,	32.69,	22.60,	1.88,1,0.69,24.545,7945,4.183010536912239,30.95,119.5,6.508932713851065,1.2855121211042553,2.05
INVE020,healthy,healthy,healthy,24.5,3635,0.23089201018335753,6755.5308009029395,6038,	25.59,	4095.00,	6.04,	28.83,	330.50,	15.62,11.96,13.5,	29.24,	182.50,	5.81,4.69,7.01,	31.17,	114.00,	2.48,3.65,2.05,	25.15,	4270.00,	3.97,	32.74,	21.95,	6.12,0.91,0.69,25.655,3685,1.343215052457485,31.755000000000003,68.65,0.10300171612332235,1.5909783883627087,4.09
INVE021,healthy,healthy,healthy,24.795,2875,0.08555435949019849,6487.353210919786,7192,	25.98,	3135.00,	0.23,	28.88,	318.00,	0.00,15,8.79,	29.23,	184.50,	12.65,6.18,4.04,	31.67,	83.65,	11.41,3.49,2.56,	24.97,	4470.00,	0.95,	32.51,	31.90,	18.18,1.22,0.64,,,,,,,,2.13
INVE022,healthy,healthy,healthy,24.375,4015,0.7252377242938949,8065.985603727657,5913,	25.03,	5940.00,	0.95,	27.60,	741.50,	6.20,18.46,13.04,	28.59,	281.50,	0.75,4.97,5.62,	30.17,	220.50,	12.51,4.86,2.62,	24.58,	5830.00,	0.97,	31.81,	50.90,	0.56,1.5,0.65,,,,,,,,2.53
INVE023,healthy,healthy,healthy,24.55,3490,0.28802720211265076,4612.497841538613,9312,	25.68,	3855.00,	4.95,	28.72,	353.50,	8.20,13.58,12.82,	28.79,	247.00,	6.30,6.73,4.26,	31.69,	82.40,	2.23,2.8,3.58,	25.58,	2940.00,	1.92,	32.77,	26.60,	11.70,1.55,0.89,,,,,,,,2.82
INVE024,healthy,healthy,healthy,24.595,3370,0.08625006479201963,6225.67141829994,5855,	25.22,	5260.00,	2.42,	27.38,	861.50,	9.44,24.23,12.91,	27.81,	478.50,	9.31,9.55,6.47,	30.58,	168.50,	0.42,4.2,1.69,	25.05,	4240.00,	3.00,	31.53,	61.50,	6.90,2.49,1.36,,,,,,,,7.29
INVE025,healthy,healthy,healthy,24.27,4355,0.29135013645923263,4786.684819147939,8352,	25.33,	4870.00,	1.16,	29.38,	329.40,	102.01,10,25.33,	27.77,	491.00,	nan,10.58,9.71,	31.14,	117.00,	nan,3.15,3.72,	25.19,	3830.00,	3.69,	32.24,	38.25,	11.28,1.71,2.39,,,,,,,,5.51
INVE026,healthy,healthy,healthy,24.66,3200,0,3669.2100601985817,7216,	26.13,	2815.00,	2.26,	28.40,	437.50,	5.01,22.99,16.51,	29.12,	197.00,	2.87,7.35,10.05,	30.79,	148.00,	14.33,6.89,2.49,	25.59,	2915.00,	2.67,	31.94,	47.40,	28.94,2.79,1.17,25.805,3335,0.6360780640358749,29.54,316.5,2.9043880427883466,8.104173174979175,6.05
INVE027,healthy,healthy,healthy,24.56,3470,0,9820.968916385385,5484,	24.94,	6330.00,	6.93,	27.98,	577.00,	8.82,13.51,20.85,	28.65,	271.50,	2.34,4.51,12.33,	30.49,	179.00,	2.37,3.71,4.95,	24.59,	5810.00,	1.22,	32.39,	34.40,	6.58,1.01,2.59,,,,,,,,3.06
INVE028,healthy,healthy,healthy,24.535,3535,0.08646098812144784,6412.321571985437,11338,	25.50,	4330.00,	4.57,	28.09,	537.00,	10.27,18.36,9.33,	27.59,	553.00,	1.79,13.42,3.62,	30.57,	169.50,	3.75,5.13,2.52,	25.08,	4145.00,	1.54,	31.81,	50.85,	3.20,2.1,0.61,,,,,,,,1.85
INVE029,healthy,healthy,healthy,24.78,2920,0.3994953566025708,4401.23209998285,7969,	26.28,	2560.00,	2.21,	28.87,	318.50,	3.77,18.41,13.41,	29.71,	133.50,	15.36,5.47,12.2,	31.01,	129.00,	21.93,6.6,3.77,	25.85,	2445.00,	2.02,	32.72,	27.60,	5.12,1.93,1.18,25.83,3280,0,31.11,107,3.965084754317089,2.7856848663798575,4.31
INVE030,healthy,healthy,healthy,24.604999999999997,3340,0.14369168485806905,6582.928318862936,5018,	25.55,	4200.00,	0.34,	27.94,	590.00,	0.96,20.78,17.14,	28.34,	336.00,	8.84,8.4,4.89,	30.31,	201.00,	3.52,6.27,5.3,	24.97,	4475.00,	3.00,	32.38,	34.55,	5.12,1.32,1.11,26.25,2450,5.772300254584062,29.36,358,0.7900634426665337,12.498650359475535,3.99
INVE031,healthy,healthy,healthy,24.939999999999998,2575,0.17011390084680011,3733.6441638209553,8170,	26.49,	2210.00,	0.64,	28.91,	312.00,	0.45,20.88,20.28,	29.66,	139.50,	21.80,6.62,8.44,	32.05,	65.95,	18.33,3.91,5.17,	25.96,	2275.00,	1.55,	32.74,	27.15,	4.43,2.04,1.39,26.305,2355,0.30025765655479725,30.740000000000002,138,2.049584873004486,5.003941035380067,6.23
INVE032,healthy,healthy,healthy,24.490000000000002,3655,0.057746572575462014,5616.136241176366,4819,	25.67,	3870.00,	2.56,	28.34,	455.50,	11.02,17.41,20.21,	28.37,	327.50,	4.97,8.88,7.79,	31.55,	90.10,	0.47,3.05,3.04,	25.46,	3200.00,	0.44,	32.60,	29.90,	0.47,1.6,1.61,25.770000000000003,3410,1.2441761545804355,30.810000000000002,132,9.642365197998375,3.3057896697431968,5.3
INVE033,healthy,healthy,healthy,24.305,4240,0.0872791748018812,9379.14859933617,6943,	25.21,	5285.00,	0.67,	27.95,	588.50,	6.13,16.47,14.48,	28.63,	274.00,	1.03,5.44,4.63,	30.23,	212.00,	4.67,5.25,3.96,	25.35,	3440.00,	1.23,	32.44,	33.10,	0.00,1.65,1.08,25.65,3710,1.5247585578146579,30.81,132,7.499617376220959,3.03859318666254,4.41
INVE034,healthy,healthy,healthy,24.14,4820,0,5526.774064863981,10479,	24.67,	7595.00,	2.70,	27.83,	637.50,	8.76,12.42,10.63,	27.96,	432.50,	3.11,5.98,5.29,	31.15,	116.50,	3.03,2.01,1.24,	24.71,	5335.00,	3.05,	32.34,	36.15,	26.02,1.16,0.93,25.490000000000002,4135,1.8810579426969825,30.28,191,15.54894492661518,3.9450884616219075,6.32
INVE035,healthy,healthy,healthy,24.200000000000003,4180,0.17531573087269395,8281.358871454626,8900,	24.89,	5515.00,	1.92,	27.69,	492.50,	4.74,15.68,13.37,	28.72,	204.50,	12.79,4.45,3.82,	31.06,	85.80,	12.86,2.13,1.9,	24.80,	5010.00,	0.28,	31.86,	49.25,	8.76,1.68,0.92,26.015,2890,1.4680417602488876,32.05,56.25,7.919595949289329,1.662239260906566,1.62
INVE036,healthy,healthy,healthy,24.134999999999998,4385,0.14648990702021084,6615.739499245812,8152,	25.01,	5085.00,	1.25,	28.63,	258.50,	4.10,8.92,7.64,	28.31,	268.00,	5.28,6.32,5.75,	30.86,	97.80,	6.07,2.63,1.82,	25.19,	3840.00,	1.10,	32.95,	23.80,	20.20,1.06,0.51,,,,,,,,1.42
INVE037,healthy,healthy,healthy,24.32,4185,0.11630045743199546,3440.0435924954268,4013,	25.96,	3180.00,	6.23,	28.76,	345.00,	9.84,16.08,14.07,	28.72,	259.00,	2.73,8.56,9.9,	32.08,	64.30,	6.60,2.65,1.8,	26.36,	1740.00,	18.69,	33.66,	14.65,	10.14,1.47,0.98,,,,,,,,5.19
INVE038,healthy,healthy,healthy,24.2,4590,0.23375430783025866,3907.518149381044,4882,	25.81,	3510.00,	0.81,	28.46,	420.00,	12.12,17.7,14.17,	29.04,	208.00,	2.72,6.22,5.17,	30.89,	138.00,	15.37,5.15,3.93,	26.00,	2200.00,	3.86,	33.29,	18.75,	1.89,1.46,1.28,,,,,,,,3.51
INVE039,healthy,healthy,healthy,24.29,4400,1.8048835089981892,6034.466717994756,7271,	25.05,	5860.00,	3.86,	27.76,	666.50,	1.59,16.83,15.86,	28.01,	418.50,	2.20,7.5,9.01,	30.08,	234.50,	0.30,5.24,3.74,	26.28,	1815.00,	1.95,	33.31,	18.80,	27.08,1.77,1,,,,,,,,3.13
INVE040,healthy,healthy,healthy,24.245,4440,0.3208156153042682,4594.30212642345,7014,	25.07,	5795.00,	1.59,	27.30,	907.50,	0.55,23.16,23.37,	27.62,	543.00,	12.50,9.83,10.93,	29.80,	282.00,	9.53,6.37,5.43,	25.56,	2975.00,	0.71,	32.13,	41.10,	8.95,2.37,1.55,,,,,,,,4.08
INVE041,healthy,healthy,healthy,24.9,2650,0.05679572539650864,3442.453541176955,5037,	26.26,	2595.00,	5.18,	28.96,	300.00,	2.83,17.12,16.99,	29.71,	132.50,	3.74,5.37,5.64,	30.92,	135.00,	2.10,6.82,5.65,	26.08,	2370.00,	1.19,	33.63,	14.35,	2.46,0.99,1.12,,,,,,,,4.14
INVE042,healthy,healthy,healthy,25.1,2275,0.45074535852528963,3463.253899475447,5440,	26.08,	2935.00,	3.13,	28.90,	313.00,	4.97,15.78,15.79,	30.21,	95.80,	20.96,3.43,2.9,	30.85,	142.00,	14.94,6.34,4.51,	25.49,	3540.00,	4.79,	32.80,	25.95,	32.97,1.2,1.38,,,,,,,,4.51
INVE043,healthy,healthy,healthy,24.715000000000003,3075,0.2574938713606683,7960.523869446236,10412,	24.46,	8825.00,	8.89,	27.12,	1015.00,	0.70,17.08,14.23,	27.46,	603.00,	1.41,7.2,6.22,	29.55,	331.00,	1.28,4.93,3.26,	24.83,	5585.00,	2.41,	32.24,	37.90,	27.61,1.11,1.14,,,,,,,,4.31
INVE044,healthy,healthy,healthy,24.25,4435,0.34990851027787173,9131.310053190127,14488,	23.93,	12600.00,	3.37,	27.05,	1070.00,	2.64,12.57,11.49,	26.75,	973.50,	1.09,8.11,6.67,	29.71,	298.00,	0.00,3.1,2.12,	24.07,	9335.00,	3.11,	31.36,	68.15,	8.61,1.2,0.88,,,,,,,,1.01
INVE045,healthy,healthy,healthy,23.895,5855,0.2071457404605923,9102.661762025673,10230,	24.48,	8805.00,	24.01,	27.65,	718.50,	6.59,12.43,9.87,	27.66,	527.00,	3.49,6.47,5.88,	30.63,	163.50,	10.81,2.5,1.6,	24.58,	6590.00,	1.50,	31.63,	56.85,	13.06,1.41,0.75,,,,,,,,1.82
INVE046,healthy,healthy,healthy,24.145000000000003,4810,0.14642923611235403,7629.454452983772,7320,	24.98,	6185.00,	2.40,	28.19,	501.50,	2.96,12,8.3,	27.92,	442.00,	3.84,7.5,6.62,	29.61,	317.50,	2.00,6.72,4.21,	25.06,	4750.00,	4.47,	32.92,	23.40,	4.83,0.81,0.48,,,,,,,,1.44
INVE047,healthy,healthy,healthy,24.14,4810,0,8886.554434074926,10656,	24.42,	9065.00,	14.59,	27.45,	824.50,	13.46,13.6,13.15,	27.77,	492.00,	1.44,5.76,5.98,	31.11,	119.50,	6.51,1.74,1.41,	24.50,	6965.00,	1.32,	31.65,	55.95,	8.21,1.32,1.3,,,,,,,,5.85
INVE048,healthy,healthy,healthy,24.16,4745,0.11707065913684311,6244.2162207410165,8041,	24.87,	6650.00,	2.55,	26.63,	1405.00,	0.50,31.26,32.33,	27.15,	743.50,	4.09,11.74,10.22,	29.53,	335.00,	6.75,6.6,5.27,	25.15,	4480.00,	0.95,	31.84,	48.80,	0.87,1.78,1.87,,,,,,,,4.25
INVE049,healthy,healthy,healthy,24.495,3640,0.08660217773258716,3820.924686738594,5398,	25.95,	3180.00,	0.89,	28.13,	520.50,	6.93,24.21,21.23,	28.06,	403.00,	8.77,13.3,10.88,	30.98,	129.50,	2.73,5.33,3.57,	25.82,	2835.00,	3.74,	32.56,	29.95,	8.74,1.73,1.6,,,,,,,,3.38
INVE050,healthy,healthy,healthy,24.265,4375,0.1457050857586148,8038.34910787707,7975,	24.91,	6495.00,	11.00,	28.18,	505.50,	3.78,11.58,8.19,	28.59,	282.00,	1.00,4.58,3.82,	30.07,	238.00,	22.58,4.83,3.08,	25.73,	3025.00,	1.64,	33.62,	15.54,	54.30,0.84,0.47,25.22,4985,1.8440096600652194,30.695,143,3.955842132512154,2.450003868385569,3.43
INVE051,healthy,healthy,healthy,24.135,4840,0.20508586982829302,7707.383305579124,7508,	24.81,	6890.00,	0.62,	27.68,	703.50,	2.91,15.1,11.62,	28.46,	309.00,	0.46,4.71,4.7,	31.23,	110.50,	4.48,2.1,1.06,	24.72,	5995.00,	1.06,	32.27,	36.70,	21.96,1,0.81,25.03,5680,1.742868826868251,29.89,248.5,1.9918500878494296,3.736509353008224,5.57
INVE052,healthy,healthy,healthy,24.015,5470,1.7372184089113594,6473.921349556532,6870,	25.08,	5765.00,	0.86,	27.62,	732.00,	1.55,18.78,16.33,	28.05,	405.50,	6.45,7.38,7.81,	29.87,	269.00,	5.78,6.11,4.24,	24.92,	5230.00,	3.79,	32.03,	43.10,	12.47,1.35,0.92,25.335,4610,0.3067708378249664,29.715,281,1.5098365434588201,5.205104930176286,5.31
INVE053,healthy,healthy,healthy,24.240000000000002,4460,0.17502643098676543,6075.520110957004,6522,	25.19,	5370.00,	1.58,	27.75,	671.00,	11.38,18.48,14.71,	29.11,	200.00,	7.78,3.91,2.99,	29.73,	295.50,	7.90,7.21,5.38,	24.99,	5010.00,	0.56,	31.86,	48.55,	13.84,1.59,1.36,25.61,3800,1.1164843913471805,30.925,122,1.1591914445681109,2.7417342288440594,4.52
INVE054,healthy,healthy,healthy,24.21,4550,0.17524331627919018,5803.479279341348,6972,	25.22,	5240.00,	7.29,	27.81,	641.50,	4.52,18.16,12.75,	28.38,	326.50,	7.15,6.56,7.08,	30.12,	227.50,	8.39,5.7,3.79,	24.97,	5060.00,	2.24,	32.92,	23.30,	8.50,0.75,0.76,25.67,3660,1.9319857409468515,30.645,148,0,3.4536930777088677,4.27
INVE055,healthy,healthy,healthy,24.21,4565,0.11682887751946011,2881.3186813186812,4612,	25.83,	3455.00,	1.02,	28.60,	383.50,	10.51,16.42,13.6,	28.54,	292.50,	5.08,8.89,10.56,	30.96,	132.00,	9.64,5,2.97,	25.78,	2915.00,	0.73,	32.78,	25.70,	9.90,1.44,1.3,26.615000000000002,1910,5.1829816422050605,32.585,39.2,18.75997582739803,1.7549246405418055,1.95
INVE056,healthy,healthy,healthy,24.25,4430,0.1166361700926239,5705.193939723642,6602,	25.36,	4765.00,	6.97,	28.32,	460.50,	13.36,14.33,9.14,	28.06,	403.50,	6.48,8.91,9.47,	30.83,	143.50,	4.43,3.95,1.84,	24.91,	5265.00,	0.67,	32.46,	32.25,	18.64,1,0.7,25.72,4395,1.1262224046202123,30.619999999999997,182.5,5.811836557697651,3.683336962098387,3.7
INVE057,healthy,healthy,healthy,25.035,2385,0.1412236431369098,3863.548477138879,5434,	26.56,	2100.00,	2.02,	29.31,	240.50,	15.58,16.94,13.08,	30.66,	70.15,	0.10,3.51,2.28,	32.99,	35.85,	8.09,2.24,0.87,	25.52,	3480.00,	0.81,	32.86,	24.20,	1.17,1.14,1.02,25.97,3690,1.9162785398009419,30.58,187,3.781319685489559,4.495778491938787,6.26
INVE058,healthy,healthy,healthy,24.305,4240,0.0872791748018812,5460.208190047935,6804,	25.29,	5015.00,	3.24,	28.07,	543.00,	10.94,16.02,15.51,	28.52,	297.00,	8.09,6.22,5.69,	30.76,	150.50,	5.17,3.93,3.82,	25.03,	4835.00,	1.02,	32.92,	23.40,	1.81,0.79,0.81,25.799999999999997,4145,2.9000760627675053,30.655,178,3.1780080053327984,3.810553422906335,5.84
INVE059,healthy,healthy,healthy,24.814999999999998,3620,1.5102421681598568,3939.818896866384,5555,	25.59,	3760.00,	13.16,	28.77,	303.00,	5.13,13.89,9.63,	29.66,	163.50,	4.76,4.6,6.02,	30.88,	163.00,	8.68,5.36,3.22,	25.64,	3200.00,	3.54,	32.78,	25.60,	2.21,1.31,0.81,25.86,3975,0.5336654952351303,30.98,143,0,3.1909133228970123,3.9
INVE060,healthy,healthy,healthy,24.259999999999998,5305,0.40805832385043095,7448.683110367892,9130,	24.70,	6945.00,	1.12,	28.94,	273.00,	15.02,6.72,4.17,	28.90,	274.00,	25.29,4.14,3.52,	30.47,	214.50,	10.22,3.79,2.28,	24.51,	6925.00,	2.96,	32.21,	38.35,	14.93,0.91,0.33,25.485,5170,2.461880476084692,30.955,145.5,7.289760630789149,2.496973874606948,2.56
INVE061,healthy,healthy,healthy,24.37,4920,0.522278295500937,6533.676071072552,8102,	25.02,	5585.00,	2.41,	28.77,	302.50,	2.57,9.26,5.58,	28.81,	286.50,	5.68,5.38,4.19,	30.72,	182.00,	8.55,4,1.69,	24.88,	5145.00,	2.06,	33.31,	18.10,	31.25,0.63,0.3,25.765,4250,0.6655122646461624,31.275,118.5,16.11129374855425,2.47314145077223,3.13
INVE062,healthy,healthy,healthy,24.48,4520,0.11554032372328961,4416.226748313926,7312,	25.26,	4720.00,	2.40,	28.48,	367.50,	0.19,13.31,10.44,	28.68,	313.50,	11.95,6.97,4.73,	30.42,	221.50,	11.17,5.76,4.09,	24.69,	5820.00,	1.21,	31.91,	45.35,	1.72,1.39,1.1,25.695,4470,2.5310309841129217,30.91,149.5,1.41894337361849,2.9674452668757882,4.96
INVE063,healthy,healthy,healthy,24.494999999999997,4475,0.2598065331977513,7810.057758842535,9803,	24.93,	5950.00,	1.19,	27.78,	579.50,	1.83,16.64,12.17,	28.67,	315.50,	2.02,5.56,5.52,	30.61,	195.00,	7.25,4.02,2.26,	24.30,	7615.00,	0.84,	31.39,	65.05,	12.28,1.53,1.04,25.165,6455,1.4240725260147356,30.615000000000002,183,5.409560074651183,2.514830975042218,5.36
INVE064,healthy,healthy,healthy,24.425,4715,0.4342518615270465,5722.6818446437555,9105,	24.77,	6670.00,	3.39,	28.31,	411.00,	12.73,10.54,8.14,	29.08,	239.50,	6.79,3.77,2.38,	29.93,	303.50,	5.82,5.58,3.59,	24.27,	7740.00,	4.75,	32.72,	26.40,	16.07,0.61,0.42,25.63,4670,2.119806196276588,31.705,88.95,1.5104023431753166,1.6898049504327561,2.07
INVE065,healthy,healthy,healthy,24.505000000000003,4435,0.028855612372440647,4436.09400775814,6635,	25.54,	3870.00,	5.12,	27.49,	706.50,	3.30,31.24,26.34,	28.56,	339.50,	3.12,9.22,6.1,	30.60,	196.00,	2.89,6.22,3.66,	25.00,	4735.00,	1.94,	31.71,	52.25,	5.01,1.98,1.01,26.265,3005,1.1765503846697962,32.155,67.6,24.26757000521883,1.9954561937270974,2.79
INVE066,healthy,healthy,healthy,24.619999999999997,4100,0.3446499339658262,5901.0050729087425,7343,	25.15,	5095.00,	4.86,	27.71,	609.50,	5.92,20.47,17.69,	28.58,	334.50,	7.40,6.9,6.53,	30.66,	189.00,	5.24,4.56,3.14,	24.85,	5260.00,	2.15,	31.91,	46.15,	23.44,1.57,1.17,25.93,3780,2.9930445764509948,30.845,156.5,7.681032127904988,3.673897465346101,4.67
INVE067,healthy,healthy,healthy,24.285,5210,0.08735105388345575,4791.884261068197,7075,	25.00,	5650.00,	7.01,	27.81,	569.50,	3.85,17.27,15.19,	28.08,	464.50,	5.63,8.65,7.64,	30.19,	256.00,	8.29,5.57,3.45,	24.99,	4740.00,	0.30,	32.41,	32.50,	9.14,1.23,0.88,26.085,3400,4.159451654038515,30.825000000000003,158.5,4.015117369513519,4.13843480410289,3.42
INVE068,healthy,healthy,healthy,24.265,5270,0.08742305145517093,7172.185430463576,10774,	24.50,	8000.00,	3.36,	27.28,	806.50,	3.59,17.24,16.12,	27.13,	872.50,	2.67,11.45,9.42,	29.40,	428.50,	4.46,6.57,4.77,	24.52,	6540.00,	1.30,	31.33,	67.85,	14.49,1.86,1.16,25.145000000000003,6540,2.594887270409349,30.905,150.5,3.2888687497048723,2.0418080393779983,4.07
INVE069,healthy,healthy,healthy,24.445,4625,0.08677931452484036,7062.962919679854,9066,	24.78,	6570.00,	0.00,	27.98,	512.00,	5.25,13.32,14.13,	28.03,	479.50,	1.62,7.66,6.3,	29.65,	363.50,	5.64,6.79,4.65,	24.72,	5705.00,	0.12,	31.96,	44.15,	2.72,1.38,1.38,25.255,6035,1.2888441744908075,29.990000000000002,280,1.0101525445522108,4.115539247004229,5.71
INVE070,healthy,healthy,healthy,24.509999999999998,4420,0.05769945174920706,3861.0662377664466,3855,	26.10,	2625.00,	4.04,	28.69,	319.50,	10.40,20.81,17.73,	29.08,	239.50,	5.61,9.58,7.76,	30.91,	160.50,	6.61,7.51,4.49,	26.54,	1680.00,	3.37,	33.50,	15.55,	20.46,1.66,1.48,26.564999999999998,2445,0.8676156824374816,31.95,76.1,5.575086316845315,2.7607816391802094,4.12
INVE071,healthy,healthy,healthy,24.425,4715,0.02895012410179762,8210.483103691922,10526,	24.70,	6985.00,	3.75,	27.01,	969.00,	0.58,23.72,20.96,	28.12,	455.50,	15.37,6.85,5.79,	29.21,	484.00,	4.68,8.51,5.49,	24.10,	8705.00,	2.19,	30.84,	93.90,	6.78,1.93,1.91,25.51,5080,0.2783884965301368,30.965,144,2.9462782549439477,2.5142611290932,4.04
INVE072,healthy,healthy,healthy,24.54,4325,0.17288674356638933,6108.442998573072,6481,	25.51,	3970.00,	0.00,	28.94,	272.50,	10.64,11.73,9.02,	29.52,	179.00,	4.74,4.73,3.5,	30.69,	185.50,	2.67,5.73,3.55,	24.81,	5385.00,	4.07,	32.89,	23.55,	8.11,0.78,0.64,25.925,3800,0.7443229275647869,30.645,179.5,1.1817940632644246,4.1898917745994,6.2
INVE073,healthy,healthy,healthy,24.89,3370,0.22727417635565525,7337.720174679222,9624,	25.35,	4445.00,	1.75,	27.61,	650.00,	0.44,24.99,22.36,	28.24,	420.00,	6.73,9.91,6.95,	29.68,	358.50,	7.30,9.89,7.47,	24.20,	8145.00,	1.13,	31.77,	50.60,	22.92,1.11,1.09,24.695,8920,6.8173972177178355,29.715,293.5,5.541211573182485,3.0422908406728597,9.13
INVE074,healthy,healthy,healthy,24.509999999999998,4430,0.05769945174920706,4372.659333208277,5832,	25.50,	3985.00,	3.37,	27.89,	540.00,	0.26,23.17,19.09,	28.12,	454.50,	7.93,11.97,10.09,	30.44,	218.00,	0.00,6.71,3.49,	25.13,	4345.00,	0.49,	32.12,	39.65,	12.31,1.63,0.82,25.85,3950,8.950718749196804,31.284999999999997,96.2,4.704244698122566,2.2556318810983673,4.07